�s���{���R�[�h���͎s�撬���R�[�h,NO,�s���{����,�s�撬����,����,����_�J�i,����_�ʏ�,����_�p��,����������,���,�ꏊ����,�Z��,����,�ܓx,�o�x,�d�b�ԍ�,�����ԍ�,�����i���j,�����i�P�ʁj,�@�l�ԍ�,���L�ғ�,�������w���,���p�\�j��,�J�n����,�I������,���p�\�������L����,�摜,�摜_���C�Z���X,�T�v,�T�v_�p��,����,����_�p��,URL,���l
215023,0104000001,�򕌌�,�x����,��V��,�j�e������,,,�d�v������,������,,,,,,,,1,��,,,1973-06-13,�I��,,,,,,,,,,,
215023,0104000002,�򕌌�,�x����,��⸈�,�z�E�L���E�C���g�E,,,�d�v������,������,,,,,,,,1,��,,,1976-09-03,�v���O�\������,,,,,,,,,,,
215023,0104000003,�򕌌�,�x����,���D��,���z�E�g�E,,,�d�v������,������,,,,,,,,1,��,,,1976-12-21,�v���O�\������,,,,,,,,,,,
215023,0104000004,�򕌌�,�x����,���D��,���z�E�g�E,,,�d�v������,������,,,,,,,,1,��,,,1976-12-21,�v���O�\������,,,,,,,,,,,
215023,0104000005,�򕌌�,�x����,�ؑ����ϐ�����F����,���N�]�E�V���E�J���[�I���{�T�c���c�]�E,,,�d�v������,���p�H�|�i,,,,,,,,1,��,,,1964-04-01,���w�s��,,,,,,,,,,,
215023,0104000006,�򕌌�,�x����,�ؑ��n����F����,���N�]�E�W�]�E�{�T�c���c�]�E,,,�d�v������,���p�H�|�i,,,,,,,,1,��,,,1966-02-08,���N���l�̓�,09:00,11:00,,,,,,,,,
215023,0104000007,�򕌌�,�x����,�_��,�E���o��,,,�d�v������,���p�H�|�i,,,,,,,,1,��,,,1966-02-08,�v���O�\������,,,,,,,,,,,
215023,0104000008,�򕌌�,�x����,�x���̎𑢗p��y�ю𑢏�@������,�g�~�J�m�V���]�E���E�O�I���r�V���]�E�W���E�c�P�^�������W��,,,�d�v�L�`����������,���̑�,,,,,,,,1,��,,,1995-06-23,�ΐ��؋��y��,09:00,16:00,�v���ٗ��A���j�E�N���N�n�͗��p�s��,,,,,,,,
215023,0104000009,�򕌌�,�x����,�ɘa�_�Ђ̓c�̐_��,�C���W���W���m�^�m�J�~�}�c��,,,�d�v���`����������,�|�\,,,,,,,,1,,,,1976-09-03,4�N����4��,,,,,,,,,,,
215023,0104000010,�򕌌�,�x����,�[�c���P�R�Õ�,���E�_�`���E�X���}�R�t��,,,�j��,���̑�,,,,,,,,1,��,,,2015-03-06,�I��,,,,,,,,,,,
