�@�l�ԍ�,�\���Җ�(����),�\���Җ�(�J�i),��\��(��E),��\��(����),����(����),�����Q(����),����(�J�i),���ԍ�,���Ǝ햼,�Ǝ�זږ�1,�Ǝ�זږ�2,�Ǝ�זږ�3,�Ǝ�זږ�4,�Ǝ�זږ�5,�Ƒ�,������1,������2,������3,������4,���݂̋��N����,���݂̗L���N����,�c�Ə��X�֔ԍ�,�c�Ə��Z��,�c�Ə��d�b�ԍ�
,�c���@����,�^�O�`�@�~�T�g,,,I�@�����@�h�@,,�A�C�@�A���@�A�C,51000020,�َq������,�َq������,,,,,,,,,,R3.7.6,R8.11.30,501-6233,�򕌌��H���s�|�@���ѕ������܌˂P�O�R�|�P�@�Q��,090-5112-7131
,�f�h�q�h�@�a�h�r�g�m�t�@�j�t�l�`�q,�M���@�r�V���k�@�N�}��,,,�A�W�A���L�b�`���@�A�X�J,,�A�W�A���L�b�`���@�A�X�J,51000021,���H�X�c��,���X�g����,,,,,,,,,,R3.7.6,R8.11.30,504-0813,�򕌌��e�����s�h���������R���ڂS,058-389-8555
,��q�@����,�I�I�N���@�Z�C��,,,�X�����@�f�`�s�d,,�i�C���Y�Q�[�g,51000022,���H�X�c��,�o�[,,,,,�o�[,�ȈՂȉc�ƂɌ���B,,,,R3.7.7,R8.11.30,501-6257,�򕌌��H���s�����������S���ڂR�T�@�l�����r���U�@�P�e,
3200001038784 ,������ЃC�[���S�b�h,�C�[���S�b�h,,�����@�L��,�H����,,�z�E�V��,51000024,���H�X�c��,��ʐH��,,,,,�V����,,,,,R3.7.9,R8.11.30,504-0831,�򕌌��e�����s�h�����䒬�S���ڂQ�P�|�P,058-382-3931
,�b�g�`�k�h�r�d�@�c�h�k�`�@�q�`�l,�`�����Z�@�f�B���@����,,,�C���h�����@�J���[�@�J�t�F,,�C���h�����E���J���[�J�t�F,51000025,���H�X�c��,���X�g����,,,,,���X�g����,,,,,R3.7.9,R8.11.30,501-6244,�򕌌��H���s�|�@���ۂ̓��R���ڂU�S,058-392-5755
,�m�@���,�g�E�@�V���E�@�t�B��,,,���ؗ����@�匹��,,�`���E�J�����E���Z���Q���R,51000026,���H�X�c��,���ؗ���,,,,,���ؗ���,,,,,R3.7.9,R8.11.30,504-0832,�򕌌��e�����s�h���ԉ����S���ڂT�V�|�T,080-9491-7829
8200001027816 ,������Ђn,�I�[,��\�����,�����@�p�i,���g���������@�����H��,,���g���C�U�J���@�}���Q�c�V���N�h�E,51000027,���H�X�c��,������,,,,,,,,,,R3.7.15,R8.8.31,504-0908,�򕌌��e�����s�߉��D�c���P�|�P�S�R,058-322-9968
2200001010884 ,�T�������������,�J�����V���E�W,,�R���@�N��,�T������������Ё@�{�����H�Z���^�[,,�J�����V���E�W�J�u�V�L�K�C�V���P�C�����J�R�E�Z���^�[,51000033,�t��������,�t��������,,,,,,,,,,R3.7.21,R9.2.28,501-6006,�򕌌��H���S��쒬�����U���ڂW�O�|�P,058-247-1977
,�g��@�^�i,���V�J���@�V���W,,,�b�n�b�b�n�o�t�q�h�n,,�R�b�R�v���I,51000034,�َq������,�َq������,,,,,,,,,,R3.7.21,R8.11.30,501-6321,�򕌌��H���s�K�������_�R�V�P�V,058-398-8003
,���c�@�܂�q,�E�`�_�@�}���R,,,�r�������������@�\���[��,,�\���[��,51000035,��������������,��������������,,,,,,,,,,R3.7.21,R8.8.31,501-6064,�򕌌��H���S�}�����k�y�P�U�P�Q�|�P,090-6412-9366
3200002012029 ,�L����Љh�M�H��,�G�C�V���R�E�M���E,��\�����,�F���@���_,����������ؑ��@�E��,,�A�W�J�`���E���T�C�����@���E�T�C,51000036,���H�X�c��,�����₫,���̑�,,,,,,,,,R3.7.20,R8.11.30,501-6207,�򕌌��H���s���ߒ��T���ڂR�U�O,058-372-8158
7180001074515 ,������Ѓf�B�E�G�[�E�A�C,�f�B�G�[�A�C,��\�����,��쑽�@�W�q,�؎|���܉����[�����@�e�����X,,�g���R�N�E�}�����[�����J�J�~�K�n���e��,51000038,���H�X�c��,�߂�ސH��,,,,,�߂�ސH��,,,,,R3.7.27,R8.8.31,504-0941,�򕌌��e�����s�O�䒬�S���ڂP�X�W,058-375-3955
4200005011662 ,�Љ���@�l������䂫,�T�N�����L,������,�˓c�@�[�N,���ˁE�p���H�[�@������䂫,,�Z�C�����p���R�E�{�E�@�T�N�����L,51000039,�˗ސ�����,�˗ސ�����,,,,,,,,,,R3.7.27,R9.2.28,501-6017,�򕌌��H���S��쒬���c���Q���ڂP,058-268-0700
4200005011662 ,�Љ���@�l������䂫,�T�N�����L,������,�˓c�@�[�N,���ˁE�p���H�[�@������䂫,,�Z�C�����p���R�E�{�E�@�T�N�����L,51000040,�َq������,�َq������,,,,,,,,,,R3.7.27,R9.2.28,501-6017,�򕌌��H���S��쒬���c���Q���ڂP,058-268-0700
,���@���,�T�J�K�~�@�^�C�K,,,�f�����������@�c����������,,�S���Y�@�_�C�i�[,51000041,���H�X�c��,������,,,,,������,,,,,R3.7.27,R8.11.30,501-6236,�򕌌��H���s�]�g�ǒ��Q�O�|�P,
9200002003724 ,�L����Њ�k���n�E�X�H��,�M�z�N�J�����n�E�X�R�E�M���E,,���@����N,�싛�����˂���,,�J���U�J�i�����E���l�I�K��,52000009,���H�X�c��,��ʐH��,,,,,,���N�P��g�p���̌������󂯂邱�ƁB,�g�p���͉��f�ŋۂ��邱�ƁB,,,R3.7.15,R9.5.31,501-1524,�򕌌��{���s�������V�P�|�Q,090-4851-8401
1180001092373 ,������Ё@�A�y�b�N�X,�A�y�b�N�X,��\�����,�X�@�g��,���c�@�l�@�D���̗����Ƃ�,,�I���x�m�T�g���g�X,52000014,�����̋@�\��L���鎩���̔��@�c��,�����̋@�\��L���鎩���̔��@�c��,,,,,,,,,,R3.7.20,R8.8.31,501-1201,�򕌌��{���s�R���U�V�U,0581-34-4755
,���c�@�B�Y,�^�J�_�@�^�c���E,,,�R�[�q�[�n�E�X�Ԕ�,,�R�|�q�|�n�E�X�@�o���o��,52000016,���H�X�c��,�y�H�i��,,,,,,,,,,R3.7.20,R8.8.31,501-0471,�򕌌��{���s���c�a���P�X�S�V,058-323-1328
,���R�@����,���R���}�@�J�c�m�u,,,�Z�u���]�C���u���{���@�c�X,,�Z�u���C���u�����g�X�\�E�P�e��,52000017,���H�X�c��,�R���r�j�G���X�X�g�A,,,,,,,,,,R3.7.20,R8.8.31,501-0462,�򕌌��{���s�@�c�T�U�S�Ԓn�P,058-324-5051
,���؁@����,���M�@�P���W,,,�������@�m�͗�,,�C�U�J���`�J��,52000018,���H�X�c��,������,,,,,,,,,,R3.7.20,R8.8.31,501-0461,�򕌌��{���s��^�K�Q�Q�Q�S�|�P,058-324-7731
2200002009612 ,�L����Ё@�����V,�`���E�I���{�E,,�e�c�@��v,�L����Ё@�����V,,�`���E�I���{�E,52000019,���H�X�c��,��ʐH��,�d�o����,,,,,���N�P��g�p���̌������󂯂邱�ƁB,�g�p���͉��f�ŋۂ��邱�ƁB,,,R3.7.20,R8.8.31,501-0461,�򕌌��{���s��^�K�Q�Q�T�W�|�P,058-324-5524
2200002009612 ,�L����Ё@�����V,�`���E�I���{�E,,�e�c�@��v,�L����Ё@�����V,,�`���E�I���{�E,52000020,��������������,��������������,,,,,,���N�P��g�p���̌������󂯂邱�ƁB,�g�p���͉��f�ŋۂ��邱�ƁB,,,R3.7.20,R8.8.31,501-0461,�򕌌��{���s��^�K�Q�Q�T�W�|�P,058-324-5524
,�����@�M�Ȏq,�i�J�V�}�L�~�R,,,��M���@�{���X,,�^�C�V���P�����g�X�e��,52000022,���H�X�c��,�����₫,�Ă����΁E���D��,,,,,���N�P��g�p���̌������󂯂邱�ƁB,�g�p���͉��f�ŋۂ��邱�ƁB,,,R3.7.28,R8.8.31,501-1205,�򕌌��{���s�]�䒆���P�O�P�T�@�@�g�~�_����,0581-34-2898
6200001003125 ,������Б�쌚��,�^�L�K���P���Z�c,,���@�a�Y,�i���@�T���S,,�T���S,52000024,���H�X�c��,�y�H�i��,,,,,,,,,,R3.7.28,R8.8.31,501-0463,�򕌌��{���s���`�W�S�V�Ԓn�̂R�@�q�`�o�h�c�r�Q�P�r���Q�K,090-3954-8629
8200001011266 ,�g�[�J�C�t�[�Y�������,�g�[�J�C�t�[�Y,��\�����,�����@���V,������Ђ�񂰃O���[�v,,�����Q�O���[�v,52000025,���H�X�c��,���H�i�Љ���{�݁j,,,,,,���N�P��g�p���̌������󂯂邱�ƁB,�g�p���͉��f�ŋۂ��邱�ƁB,,,R3.7.28,R8.8.31,501-0466,�򕌌��{���s���^�K�U�V�O�Ԓn�P,058-323-0676
7200005001982 ,�Љ���@�l�������̉�,�A�V�^�m�J�C,,���@����,�ǂ񂮂葺�����H��,,�h���O�������t�N�V�R�E�W���E,52000026,������H�i������,������H�i������,,,,,,,,,,R3.7.28,R8.8.31,501-0471,�򕌌��{���s���c�Q�R�R�Q,058-320-3450
,�]��@�_��,�G�T�L�@�q���~,,,����,,�A��,52000027,���H�X�c��,�y�H�i��,,,,,,,,,,R3.7.28,R8.8.31,501-0471,�򕌌��{���s���c�P�T�P�|�R,058-323-0411
,���w�@�v�V,�J�i�U�V�q�T���L,,,�t�@�~���[�}�[�g�{���V�_�O�X,,�t�@�~���[�}�[�g���g�X�e���W���}�G�e��,52000028,���H�X�c��,�R���r�j�G���X�X�g�A,,,,,,,,,,R3.7.28,R8.8.31,501-0471,�򕌌��{���s���c�P�O�S�R�ԂP,058-320-4139
3200001033232 ,������ЃG���g��,�G���g��,��\�����,�a�c�@����,�i���Ƃ��傤�Ǖi�@�G���g��,,�L�b�T�g�`���E�h�q���G���g��,53000016,�َq������,�َq������,,,,,,���N�P��g�p���̌������󂯂邱�ƁB,�g�p���͉��f�ŋۂ��邱�ƁB,,,R3.7.12,R8.11.30,503-0017,�򕌌���_�s���쒬�Q���ڂP�O�W�W,0584-71-8302
4200001015691 ,������Њۖ�,�}���A�L,��\�����,�g�c�@����,�ۖ�,,�}���A�L,53000023,�H��������,�H��������,,,,,,,,,,R3.7.1,R9.5.31,503-1312,�򕌌��{�V�S�{�V���O�_���X�R�P,0584-32-0262
,�F�[�@�T�i,�E�m�E�@���E�W,,,���f�B�[�X�o�[�@�V���E�X,,���f�B�[�X�o�[�@�V���E�X,53000025,���H�X�c��,�o�[,,,,,�o�[,���N�P��g�p���̌������󂯂邱�ƁB,�g�p���͉��f�ŋۂ��邱�ƁB,,,R3.7.12,R8.11.30,503-0886,�򕌌���_�s�s�����P���ڂS�O�@��T���r���Q�e,
,�F�[�@�T�i,�E�m�E�@���E�W,,,���f�B�[�X�o�[�@���i,,���f�B�[�X�o�[�@���i,53000026,���H�X�c��,�o�[,,,,,�o�[,���N�P��g�p���̌������󂯂邱�ƁB,�g�p���͉��f�ŋۂ��邱�ƁB,,,R3.7.12,R8.11.30,503-0886,�򕌌���_�s�s�����P���ڂS�O�@��T���r���P�e,0584-71-7278
,�F�[�@�T�i,�E�m�E�@���E�W,,,���f�B�[�X�o�[�@�\��,,���f�B�[�X�o�[�@�\��,53000027,���H�X�c��,�o�[,,,,,�o�[,�ȈՂȉc�ƂɌ���B,���N�P��g�p���̌������󂯂邱�ƁB,�g�p���͉��f�ŋۂ��邱�ƁB,,R3.7.12,R8.11.30,503-0886,�򕌌���_�s�s�����P���ڂS�O�@��T���r���Q�e,
2260001008997 ,������Њ��q�p�X�^,�J�u�V�L�K�C�V���J�}�N���p�X�^,,�V�؁@����,���q�p�X�^�@�A�N�A�E�H�[�N��_�X,,�J�}�N���p�X�^�@�A�N�A�E�H�[�N�I�I�K�L�e��,53000028,���H�X�c��,���X�g����,�ٓ���,,,,���X�g����,,,,,R3.7.9,R8.11.30,503-0015,�򕌌���_�s�ђ��U���ڂW�O�|�Q�P,058-483-8309
7200002012363 ,�L����ЃG���E�G�X�E�G�X,�G���G�X�G�X,��\�����,�O��@����,���X�g�����@�݂₯,,�~���P,53000029,�َq������,�َq������,,,,,,,,,,R3.7.9,R8.11.30,503-0889,�򕌌���_�s�������Q���ڂV�|�R,0584-75-5847
9200002015050 ,�L����ЊC�É^��,���E�Q���K�C�V���J�C�d�E���\�E,,�R�c�@���,�s�h�j�j�d�q,,�e�B�b�P��,53000031,���H�X�c��,�y�H�i��,,,,,,,,,,R3.7.9,R9.5.31,503-0652,�򕌌��C�Îs�C�Ò��n�ڂU�T�V,0584-51-2718
9200002015050 ,�L����ЊC�É^��,���E�Q���K�C�V���J�C�d�E���\�E,,�R�c�@���,�s�h�j�j�d�q,,�e�B�b�P��,53000032,�َq������,�َq������,,,,,,,,,,R3.7.9,R9.5.31,503-0652,�򕌌��C�Îs�C�Ò��n�ڂU�T�V,0584-51-2718
2180001059198 ,������ЊC��,�J�C�n��,��\�����,�����@�W,�V����@��_�w�O�X,,�V���W�_�C�I�I�K�L�G�L�}�G�e��,53000033,���H�X�c��,������,�ٓ���,,,,,,,,,R3.7.12,R8.11.30,503-0901,�򕌌���_�s�������P���ڂS�|�S,0584-83-5558
3180002021619 ,�L����Ђr�`�m�s�h�o�t�q�@�s�q�`�c�h�m�f,�T���e�B�v�[���g���[�f�B���O,��\�����,�M���@�P�T��,�r�`�m�s�h�o�t�q,,�T���e�B�v�[��,53000034,���H�X�c��,��ʐH��,,,,,,,,,,R3.7.12,R8.11.30,503-0808,�򕌌���_�s�O�˒��S�U�R�|�P,
1200001030009 ,������Ђ`�p�v�����j���O,�G�[�L���[�v�����j���O,,�����@����,�ᓜ���L�b�`������,,�e�C�g�E�Z�������L�b�`���Q���L,53000037,�َq������,�َq������,,,,,���ِ����̔�,,,,,R3.7.12,R8.8.31,503-2305,�򕌌������S�_�˒��_�˂P�P�P�Q�|�P,0584-28-0707
2200001036483 ,�x�m�p�[���H�i�������,�t�W�p�[���V���N�q���J�u�V�L�K�C�V��,��\�����,���c�@�s�F,�x�m�p�[���H�i�������,,�t�W�p�[���V���N�q���J�u�V�L�K�C�V��,53000038,����ޔ̔���,����ޔ̔���,,,,,,,,,,R3.7.15,R8.8.31,503-0114,�򕌌������S�������X���P�T�T�W�|�Q,0584-84-9031
2200001036483 ,�x�m�p�[���H�i�������,�t�W�p�[���V���N�q���J�u�V�L�K�C�V��,��\�����,���c�@�s�F,�x�m�p�[���H�i�������,,�t�W�p�[���V���N�q���J�u�V�L�K�C�V��,53000039,�H�i�̏�������,�H�i�̏�������,,,,,,,,,,R3.7.15,R8.8.31,503-0114,�򕌌������S�������X���P�T�T�W�|�Q,0584-84-9031
,���@�M�K,���m�@�m�u���L,,,�I�A�V�X,,�I�A�V�X,53000054,���H�X�c��,�y�H�i��,,,,,,,,,,R3.7.21,R8.8.31,503-2100,�򕌌��s�j�S���䒬�P�O�X�O�|�P�T,0585-45-2525
,���؁@����,�^�J�M�@�P���W,,,������,,�E�I�V�Q,53000056,���H�X�c��,�����X,�d�o����,�ٓ���,,,,,,,,R3.7.16,R8.8.31,503-1501,�򕌌��s�j�S�փP�����厚�փP���R�Q�O�U�|�Q,0584-43-0019
,���؁@����,�^�J�M�@�P���W,,,������,,�E�I�V�Q,53000057,��������������,��������������,,,,,,,,,,R3.7.16,R8.8.31,503-1501,�򕌌��s�j�S�փP�����厚�փP���R�Q�O�U�|�Q,0584-43-0019
5200001014684 ,������ЃE�b�h�y�b�J�[,�E�b�h�y�b�J�[,,�k��@�j�Y,�u�Y���v�y�b�J�[,,�T���`���N�@�y�b�J�[,53000064,�Е�������,�Е�������,��Ђ�,,,,,,,,,R3.7.21,R8.8.31,503-1501,�򕌌��s�j�S�փP�����փP���R�O�X�W�|�P,0584-43-2804
5200001014684 ,������ЃE�b�h�y�b�J�[,�E�b�h�y�b�J�[,,�k��@�j�Y,�u�Y���v�y�b�J�[,,�T���`���N�@�y�b�J�[,53000065,���H�X�c��,����������,�ٓ���,,,,,,,,,R3.7.21,R8.8.31,503-1501,�򕌌��s�j�S�փP�����փP���R�O�X�W�|�P,0584-43-2804
5200001014684 ,������ЃE�b�h�y�b�J�[,�E�b�h�y�b�J�[,,�k��@�j�Y,�u�Y���v�y�b�J�[,,�T���`���N�@�y�b�J�[,53000066,�َq������,�َq������,,,,,,,,,,R3.7.21,R8.8.31,503-1501,�򕌌��s�j�S�փP�����փP���R�O�X�W�|�P,0584-43-2804
2290001034974 ,������Ѓv���i�X,�v���i�X,,����@�C�j,�ق��Ƃ����ƈ����n���X,,�z�b�g���b�g�A���p�`�X�m�}�^�e��,53000070,���H�X�c��,�ٓ���,,,,,�ٓ���,,,,,R3.7.26,R8.8.31,503-0112,�򕌌������S�����������P�P�S�S,0584-61-1180
,�R���@�m��,���}�O�`�@�g���q�T,,,��,,�J�[,53000071,���H�X�c��,������,,,,,������,,,,,R3.7.30,R9.2.28,503-0864,�򕌌���_�s��j���S���ڂQ�W,0584-74-6674
4200001005536 ,���c�����������,���X�_�V���E�W�J�u�V�L�K�C�V��,,���c�@���F,�h�g�[���R�[�q�[�V���b�v�@�A�X�e�B��_�X,,�h�g�[���R�[�q�[�V���b�v�@�A�X�e�B�I�I�K�L�e��,53000073,���H�X�c��,�y�H�i��,,,,,,,,,,R3.7.30,R8.11.30,503-0901,�򕌌���_�s�������P���ڂP�S�T�@��_�X�e�[�V�����r���Q�e,584837606
,�ƈ�@�,�e���C�@�q�g�V,,,�����X�_���[���@�A���S�[�g,,�����X�_���[���@�A���S�[�g,53000081,���H�X�c��,�y�H�i��,,,,,,,,,,R3.7.29,R8.8.31,503-2122,�򕌌��s�j�S���䒬�\�����c�S�U�S�W�|�P�P,0584-23-1216
,�ƈ�@�,�e���C�@�q�g�V,,,�����X�_���[���@�A���S�[�g,,�����X�_���[���@�A���S�[�g,53000082,�A�C�X�N���[���ސ�����,�A�C�X�N���[���ސ�����,,,,,,,,,,R3.7.29,R8.8.31,503-2122,�򕌌��s�j�S���䒬�\�����c�S�U�S�W�|�P�P,0584-23-1216
,�͐� �}���K���^ �o�����e�B��,�J���Z�@�}���K���^�@�o�����e�B��,,,�܂�,,�}��,53000093,���H�X�c��,�y�H�i��,,,,,,,,,,R3.7.30,R8.8.31,503-2319,�򕌌������S�_�˒��O�c�P�R�P�|�W,0584-27-9124
,����@�R���q,�I�K���@���~�R,,,�����ȃI�[�K�j�b�N�t�@�[���@���ׂ�,,�`�C�T�i�I�[�K�j�b�N�t�@�[���@�^�x��,55000011,���H�X�c��,�y�H�i��,�����p��,,,,,,,,,R3.7.12,R8.8.31,501-1311,�򕌌��K��S�K��쒬�J�����ςP�Q�P�|�P,090-9929-7225
200002015806 ,������ЃT�X�e�i,�J�u�V�L�K�C�V���T�X�e�i,��\�����,��R�@��,�r�g�`�q�d���b�n�l�l�t�m�h�s�x�@�r�o�`�b�d�@�v��,,�V�F�A�A���h�R�~���j�e�B�X�y�[�X��,55000012,���H�X�c��,���X�g����,�y�H�i��,,,,,,,,,R3.7.15,R8.11.30,503-2422,�򕌌��K��S�r�c���c���P�W�U�|�S,
9200003005249 ,���[�N�X�J�C�������,���[�N�X�J�C�S�E�h�E�K�C�V��,��\�Ј�,�s���@���a,�ق��Ƃ����ƒr�c���X,,�z�b�g���b�g�C�P�_�e��,55000013,���H�X�c��,�ٓ���,,,,,,,,,,R3.7.21,R8.11.30,503-2424,�򕌌��K��S�r�c���r��Q�O�X�|�P,0585-44-0520
9200001016207 ,������ЃL�B�|�[�V����,�J�u�V�L�J�C�V���L�B�|�[�V����,,�ؑ��@�`��,������ЃL�B�|�[�V�����@�����H��,,�J�u�V�L�J�C�V���L�B�|�[�V�����@�����^�R�E�W���E,55000016,�H�i�̏�������,�H�i�̏�������,,,,,,,,,,R3.7.28,R8.11.30,503-2426,�򕌌��K��S�r�c�������Q�U�W�|�P,0585-35-8711
,���@���,�I�E�@�`���E�L,,,�n�����؁@����,,�\�E�~�`���E�J���C����,56000021,��������������,��������������,,,,,,,,,,R3.7.8,R8.2.28,501-3700,�򕌌����Z�s�P�P�O�|�P�R�@,0575-35-3658
6200001018981 ,������ЃG�R�s�A����,�G�R�s�A�w�C�Z�C,��\�����,�R���@����,�������O,,�w�C�Z�C�t�N���E,56000023,��������������,��������������,,,,,,,,,,R3.7.9,R8.8.31,501-3521,�򕌌��֎s���V�ۂQ�T�Q�S�|�P,0575-49-3772
6200001018981 ,������ЃG�R�s�A����,�G�R�s�A�w�C�Z�C,��\�����,�R���@����,�p���H�[����,,�p���R�E�{�E�w�C�Z�C,56000024,���H�X�c��,���̑�,,,,,,�ȈՂȉc�ƂɌ���B,,,�戵�i��:�\�t�g�N���[���A�R�[�q�[,R3.7.9,R8.8.31,501-3521,�򕌌��֎s���V�ۂQ�T�O�R�|�Q,080-6955-1178
1200001038737 ,������Ђ������r,�����Y,��\�����,�͍��@�R�Y,�t�@�~���[�}�[�g�ւ��������X,,�t�@�~���[�}�[�g�Z�L�V���E�`�e��,56000025,���H�X�c��,�R���r�j�G���X�X�g�A,,,,,,,,,,R3.7.9,R9.5.31,501-3217,�򕌌��֎s���L�m�P�P�W�W�Ԓn�P,0575-21-5502
1200001038737 ,������Ђ������r,�����Y,��\�����,�͍��@�R�Y,�t�@�~���[�}�[�g���Z���X,,�t�@�~���[�}�[�g�~�m�J�~�W���E�e��,56000026,���H�X�c��,�R���r�j�G���X�X�g�A,,,,,,,,,,R3.7.9,R8.2.28,501-3700,�򕌌����Z�s�V�W�|�Q�@,0575-31-0650
8180005018701 ,�����c�������@�l�Љ�����Ǝx���Z���^�[,�V���J�C�t�N�V�W�M���E�V�G���Z���^�[,,�R�{�@����,���ی㓙�f�C�T�[�r�X�u���[�X�J�C���|��,,�z�E�J�S�g�E�f�C�T�[�r�X�u���[�X�J�C���Q�K��,56000027,��������������,��������������,,,,,,,,,,R3.7.14,R8.8.31,501-2605,�򕌌��֎s���|�쒬�Օ��V�V�T,0575-46-2330
8180005018701 ,�����c�������@�l�Љ�����Ǝx���Z���^�[,�V���J�C�t�N�V�W�M���E�V�G���Z���^�[,,�R�{�@����,���ی㓙�f�C�T�[�r�X�u���[�X�J�C���|��,,�z�E�J�S�g�E�f�C�T�[�r�X�u���[�X�J�C���Q�K��,56000028,�َq������,�َq������,,,,,,,,,,R3.7.14,R8.8.31,501-2605,�򕌌��֎s���|�쒬�Օ��V�V�T,0575-46-2330
,�[�V�@����,�t�J�U���@�T�_�A�L,,,�L�����Q��,,�q���L���Z�C�A���W��,56000030,�A�C�X�N���[���ސ�����,�A�C�X�N���[���ސ�����,,,,,,,,,,R3.7.21,R9.5.31,501-3803,�򕌌��֎s���{���ʂV���ڂP�O�|�W,0575-22-6528
7180301034722 ,�������GUILBUIL,�J�u�V�L�K�C�V���M���r��,,���c�@������,�S�㔪�����R���@�H����,,�O�W���E�n�`�}���V�[���G���V���N�h�E�u,57000004,���H�X�c��,��ʐH��,,,,,,,,,,R3.7.7,R9.2.28,501-4238,�򕌌��S��s���������V�T�V,
3200002027753 ,�L����Ђ�����,���E�Q���K�C�V���I�^�t�N,,�R������,�s�b�c�F���A�S���U,,�s�b�c�F���A�S���U,57000051,��������������,��������������,,,,,,,,,,R3.7.12,R8.11.30,501-5126,�򕌌��S��s�����������ʗǂV�R�R�@�s�b�c�F���A�S���U,575825707
,�͍��@���F,�J���A�C�@�n�c�q�R,,,�ˉ�,,�L����,57000054,�َq������,�َq������,,,,,,,,,,R3.7.14,R9.2.28,501-4107,�򕌌��S��s�������匴�P�R�R�W,0575-79-3374
5200003003990 ,������Ѓt�@�~���[�J���I�P���}�g,�S�E�h�E�K�C�V���t�@�~���[�J���I�P���}�g,,�ʖؒq�q,�t�@�~���[�J���I�P�@���}�g,,�t�@�~���[�J���I�P���}�g,57000055,���H�X�c��,���̑�,,,,,�J���I�P,,,,,R3.7.12,R9.5.31,501-4612,�򕌌��S��s��a�����P�P�T�|�P,575884700
,�ēc�I,���l�_�^�N�~,,,���m��,,�~�Y�o�\�E,57000057,�H���̔���,�H���̔���,,,,,,,,,,R3.7.16,R8.11.30,501-5301,�򕌌��S��s���h���Ђ邪��4670-94,575732155
,�ēc�I,���l�_�^�N�~,,,���m��,,�~�Y�o�\�E,57000058,����ޔ̔���,����ޔ̔���,,,,,,,,,,R3.7.16,R8.11.30,501-5301,�򕌌��S��s���h���Ђ邪��4670-94,575732155
5180001140748 ,������Ђs�D�a�q�`�h�m�r,�J�u�V�L�K�C�V���e�B�[�u���C���Y,,����@�O��,�b�`�e�d�@�m�`�m�`�r�g�h,,�J�t�F�i�i�V,57000059,���H�X�c��,�y�H�i��,,,,,�y�H�i��,,,,,R3.7.16,R8.11.30,501-5303,�򕌌��S��s���h����h�R�Q�U�Q�|�T�R,070-1531-3007
5180001140748 ,������Ђs�D�a�q�`�h�m�r,�J�u�V�L�K�C�V���e�B�[�u���C���Y,,����@�O��,���H���������`,,�I�V���N�W�h�R���O�D�[,57000060,���H�X�c��,�y�H�i��,,,,,�y�H�i��,,,,,R3.7.16,R8.11.30,501-5303,�򕌌��S��s���h����h�P�W�O�W�|�Q,575725035
,���@���F,�C�m�E�G�@�m���q�R,,,�Ղ�񂽂�,,�v�����^��,57000061,�َq������,�َq������,,,,,,,,,,R3.7.14,R9.2.28,501-4233,�򕌌��S��s����������S�W�|�P,575670115
,�a�c�@����,���_�@�g���n��,,,�a�̐H�@�a�c,,���m�V���N���_,57000063,���Y���i������,���Y���i������,,,,,���ØI��,,,,,R3.7.29,R9.2.28,501-4101,�򕌌��S��s��������c�X�O�|�P�P,0575-79-2232
,�h���@�v��,�X�~�@�q�T�m��,,,�������@�N��,,�C�U�J���@�l������,58000020,���H�X�c��,������,,,,,,,,,,R3.7.7,R8.8.31,505-0041,�򕌌����Z���Ύs���c���S�Q�R�T�Ԓn,090-1759-2577
9100001024178 ,������ЃA�r���e�B,�A�r���e�B,,���c�@�s�u,�}�N�h�i���h�@�Q�S�W���X,,�}�N�h�i���h�@�J�j�e��,58000021,���H�X�c��,�y�H�i��,,,,,,,,,,R3.7.7,R9.5.31,509-0203,�򕌌����s���b�y���×ǂT�V�S�R�|�Q,0574-63-3021
6200001033072 ,�l�N�X�g�E�C�m�x�[�V�����������,�l�N�X�g�C�m�x�[�V����,��\�����,���@���q,�l�n�n�m�@���@�l�d�@�b�`�e�d,,���[���A���h�~�[�J�t�F,58000061,�َq������,�َq������,,,,,,,,,,R3.7.13,R9.5.31,509-0214,�򕌌����s�L���T���ڂP�P�U�|�P,0574-66-2700
,�ؑ��@����,�L�����@�i�����V,,,�J�[���x�b�W,,�J�[���x�b�W,58000123,���H�X�c��,�y�H�i��,,,,,,,,,,R3.7.21,R9.5.31,509-0202,�򕌌����s���b�y�Q�R�R�V�|�P�@�t�@�~���[�G�X�e�[�g�`�|�P,090-4188-4459
,�����@��,�J�g�E�q�g�V,,,�����炭,,�Z�C���N,58000164,���H�X�c��,������,,,,,,,,,,R3.7.21,R8.8.31,505-0034,�򕌌����Z���Ύs�È䒬���È�Q�S�O�V,0574-25-1268
9200002017385 ,������Љ��䃂�[���h,�J�u�V�L�K�C�V�����R�C���[���h,��\�����,����@�O��,�T�j�[����t�@�[��,,�T�j�[�T���@�t�@�[��,58000171,���H�X�c��,�y�H�i��,,,,,,,,,,R3.7.21,R9.5.31,509-0238,�򕌌����s��X�P�O�V�S�Ԓn�Q,090-8581-3213
9200002016783 ,�L����Ў��@�H�i,���E�Q���K�C�V���q�`�\�E�V���N�q��,��\�����,�����@����,�L����Ў��@�H�i,,���E�Q���K�C�V���q�`�\�E�V���N�q��,58000176,�َq������,�َq������,,,,,,,,,,R3.7.26,R9.2.28,509-0511,�򕌌����ΌS���@���_���P�O�T�U�S�|�P,0574-46-1749
,�㓡�@���~�q,�S�g�E���~�R,,,�m�d�v�i���@�R�g�u�L��,,�j���E�L�b�T�R�g�u�L��,59000018,���H�X�c��,�y�H�i��,�ٓ���,,,,�y�H�i���A�ٓ���,,,,,R3.7.12,R8.11.30,507-0901,�򕌌��������s�}�����_�˂Q�P�R�R�|�Q,
4200002023009 ,�L����ЃX�^�C���z�[��,�X�^�C���z�[��,��\�����,�X�@���_,�X�̍H�[,,�����m�R�E�{�E,59000021,��������������,��������������,,,,,,,,,,R3.7.6,R8.11.30,507-0807,�򕌌��������s���c���U���ڂV�P�|�P,0572-56-8585
4200002023009 ,�L����ЃX�^�C���z�[��,�X�^�C���z�[��,��\�����,�X�@���_,�X�̍H�[,,�����m�R�E�{�E,59000022,�َq������,�َq������,,,,,,,,,,R3.7.6,R8.11.30,507-0807,�򕌌��������s���c���U���ڂV�P�|�P,0572-56-8585
4200002018124 ,�L����АH�V,���E�Q���K�C�V���V���N�[��,��\�����,���c�@���I,�������Z�d���싅���@���՗��H��,,�`���E�L���E�R�E�R�E�R�E�V�L���L���E�u�@�����E�R�����E�V���N�h�E,59000023,���H�X�c��,���H�i���̑��j,,,,,,,,,,R3.7.1,R8.8.31,509-6101,�򕌌����Q�s�y�򒬂W�O�P�V�|�Q�O�Q,
,�g��@���v,���V�J���@�~�L�q�T,,,�Ђ��Ђ��{,,�q�G�q�G�h��,59000024,��������������,��������������,,,,,,,,,,R3.7.21,R9.2.28,507-0037,�򕌌��������s���H���P���ڂQ�Q�V,0572-56-0160
,�k�@������,�^�`�o�i�}�X�~,,,�Ö��ƃJ�t�F�@�k,,�R�~���J�J�t�F�^�`�o�i,59000027,���H�X�c��,�y�H�i��,,,,,�y�H�A�i��,,,,,R3.7.15,R8.8.31,509-6471,�򕌌����Q�s��Ւ��S�U�R�|�P,
,��{�@�C�i,���J�~���V���E�W,,,�܂�ڂ���,,�}���{�E��,59000029,��������������,��������������,,,,,,,,,,R3.7.28,R8.11.30,507-0817,�򕌌��������s�唨���哴�S�W�|�Q�W�@���C���{�[�n�C�c�P�O�R,090-3933-4452
,��{�@�C�i,���J�~���V���E�W,,,�܂�ڂ���,,�}���{�E��,59000030,�َq������,�َq������,,,,,,,,,,R3.7.28,R8.11.30,507-0817,�򕌌��������s�唨���哴�S�W�|�Q�W�@���C���{�[�n�C�c�P�O�R,090-3933-4452
4200003005187 ,�O���������,�T���Z�C,��\����,���@���@,�Z�u���|�C���u���@���Q�R�c���X,,�Z�u���C���u���~�Y�i�~���}�_�`���E�e��,59000031,���H�X�c��,�R���r�j�G���X�X�g�A,,,,,,,,,,R3.7.27,R8.8.31,509-6104,�򕌌����Q�s�R�c���X�O�O�|�P,0572-68-6660
,���R�@�O�q,�g�N���}�q���R,,,�؍��s��@�Z�b�g��,,�J���R�N�C�`�o�A�G�b�g��,59000035,���H�X�c��,��ʐH��,����������,,,,,,,,,R3.7.26,R9.2.28,507-0041,�򕌌��������s�������U���ڂU�T�@���o�e�B�����P�O�Q����,090-5634-3047
,�Ԗ؁@�^��,�A�J�M�V���W,,,�؂����n�E�X,,�g���`�����n�E�X,59000038,���H�X�c��,������,,,,,,,,,,R3.7.29,R9.5.31,509-5122,�򕌌��y��s�y��Ò��y����P���ڂR,
1200005009222 ,�Љ���@�l����ۂە�����,�V���J�C�t�N�V�z�E�W���^���|�|�t�N�V�J�C,������,���@����,���肭��̗����Ð�@��Â���ٖ��H�[,,�N���N���m�T�g�i�J�c�K���e�d�N���J�������R�E�{�E,60000013,�Е�������,�Е�������,,,,,,,,,,R3.7.7,R8.11.30,508-0101,�򕌌����Ð�s�c�؎��`��S�W�|�T�Q�Q,0573-67-9028
1200001038431 ,������Ђg�������@�k������,�w���g���C�t,,������@�p�Y,�q�n�w,,���b�N�X,60000014,���H�X�c��,�o�[,,,,,�o�[,,,,,R3.7.7,R8.11.30,508-0038,�򕌌����Ð�s�V���P�|�P�Q�@�X�K�C�r���P�����Q�e,0573-64-2272
,�����@�F��,�e���j�V�@�R�E�^,,,�A�I�L�[�Y�E�s�U���Ð�X,,�A�I�L�[�Y�s�U�i�J�c�K���e��,60000015,���H�X�c��,���̑�,,,,,���̑�,,,,,R3.7.7,R8.11.30,508-0045,�򕌌����Ð�s����̖ؒ��R�|�U�@���S���r���P�e,0573-62-2288
,�����@���R��,�I�N�����}���~,,,���R�_��,,���R���}�m�E�G��,60000016,���H�X�c��,�y�H�i��,,,,,�y�H�i��,,,,,R3.7.7,R8.11.30,508-0011,�򕌌����Ð�s���P�U�U�O�|�U�R,090-8861-9921
7200002024111 ,�t�@���t�@�[�~���O�L�����,�t�@���t�@�[�~���O,��\�����,�c���@�S��,�������Y���s���H��,,�J�V���T���`���N�C�`�J�R�E�W���E,60000017,�Е�������,�Е�������,,,,,,,,,,R3.7.7,R8.8.31,508-0421,�򕌌����Ð�s���q��U�S�S�T,0573-79-3601
4180001078122 ,�O�����H�@�������,�T�����c�J�R�E�L,��\�����,�哇�@����,����g�����X�@���珕�@���Ð�X,,�J���A�Q�Z�������e���@�J���X�P�@�i�J�c�K���e��,60000018,���H�X�c��,����������,�ٓ���,,,,�����������A�ٓ���,,,,,R3.7.8,R8.11.30,508-0001,�򕌌����Ð�s���Ð����P�P�R�T�|�T,0573-65-1101
7200003005151 ,������ЃR�g��,�R�g��,,�鑺�@������,�k���@�������������@���������������������@�j�`�r�t�l�h,,���@�v�e�B�@�p�e�B�X���[�@�J�X�~,60000020,���H�X�c��,�y�H�i��,,,,,,,,,,R3.7.12,R9.2.28,509-7204,�򕌌��b�ߎs�������i�c�R�S�P�|�S�P,0573-22-9361
7200003005151 ,������ЃR�g��,�R�g��,,�鑺�@������,�k���@�������������@���������������������@�j�`�r�t�l�h,,���@�v�e�B�@�p�e�B�X���[�@�J�X�~,60000021,�َq������,�َq������,,,,,,,,,,R3.7.12,R9.2.28,509-7204,�򕌌��b�ߎs�������i�c�R�S�P�|�S�P,0573-22-9361
3200001024306 ,������В�������,�`���E�u�V���E�W,��\�����,����@���v,�����,,�_���},60000023,���H�X�c��,�ē���,,,,,,,,,,R3.7.12,R8.11.30,508-0033,�򕌌����Ð�s���c���Q���ڂQ�U�P�|�P�W�|�P�O�@�a�P�r��,0573-22-9996
2200001024216 ,������������J��,�^�J�V�}�J�C�n�c,��\�����,���@����,���E���W�@�G���h���X�i�C�g,,���E���W�@�G���h���X�i�C�g,60000024,���H�X�c��,�L���o���[,,,,,,,,,,R3.7.12,R8.11.30,508-0001,�򕌌����Ð�s���Ð�X�U�S�|�Q,
,���R�@��i,���R���}�@���C�V,,,��V�����E�a���E�������@�����ڂ�,,�M���V�����@���M���E�@�N�V�����E���@�E�V�{��,60000025,���H�X�c��,��ʐH��,,,,,��ʐH��,,,,,R3.7.15,R8.11.30,508-0033,�򕌌����Ð�s���c���Q���ڂU�|�V�@�P�e,
,���R�@��i,���R���}�@���C�V,,,��V�����E�a���E�������@�����ڂ�,,�M���V�����@���M���E�@�N�V�����E���@�E�V�{��,60000026,�H���̔���,�H���̔���,,,,,,,,,,R3.7.15,R8.11.30,508-0033,�򕌌����Ð�s���c���Q���ڂU�|�V�@�P�e,
,�a�c�@�F��,���_�@�g���~,,,�݂�����?��,,�~�J�T�M�R�E�W��,60000028,�݂����͂��傤�䐻����,�݂����͂��傤�䐻����,,,,,,,,,,R3.7.20,R9.2.28,509-7208,�򕌌��b�ߎs�}�u���P�I�P�U�O�Q�|�Q,090-8738-1586
,�a�c�@�F��,���_�@�g���~,,,�݂�����?��,,�~�J�T�M�R�E�W��,60000029,��������������,��������������,,,,,,,,,,R3.7.20,R9.2.28,509-7208,�򕌌��b�ߎs�}�u���P�I�P�U�O�Q�|�Q,090-8738-1586
6200003004039 ,������Ђl���b�g����,���`���E,��\�Ј�,���V�@�F�m,�s�����@�q�x�n�j�`�m�@�n�@�@�b�������@�n,,�U�@�����J���@�I�[�@�J�t�F�@�I�[,60000030,���H�X�c��,�y�H�i��,�o�[,,,,�y�H�i���A�o�[,,,,,R3.7.20,R8.11.30,508-0033,�򕌌����Ð�s���c���Q���ڂQ�|�Q�S,0573-84-0829
,�с@�ǎ�,�n���V�@���V�L,,,�r�����������@��������,,�\���C���@�J�t�F,60000031,���H�X�c��,�y�H�i��,�ٓ���,,,,�y�H�i���A�ٓ���,,,,,R3.7.20,R8.11.30,508-0011,�򕌌����Ð�s���T�U�X�|�T�@�Q�e,0573-67-9091
,�ɓ��@��,�C�g�E�@���^��,,,���������@���������@������������,,�t���[�J�t�F�R�N��,60000032,���H�X�c��,��ʐH��,,,,,��ʐH��,,,,,R3.7.29,R9.2.28,509-7201,�򕌌��b�ߎs��䒬�Q�P�T�|�P�O,090-4861-7078
,��e�@����,�I�I���L�}�T�Y�~,,,��ˉ�,,�q�_��,61000003,���H�X�c��,���X�g����,,,,,���X�g����,,,,,R3.7.2,R8.11.30,509-2207,�򕌌����C�s���V���W�S�U,0576-24-1117