�s���{���R�[�h���͎s�撬���R�[�h,NO,�s���{����,�s�撬����,����,����_�J�i,���,�Z��,����,�ܓx,�o�x,�A�N�Z�X���@,���ԏ���,�d�b�ԍ�,�����ԍ�,FAX�ԍ�,�@�l�ԍ�,�c�̖�,�F���N����,���e���,����N��,���p�\�j��,�J�n����,�I������,���p�\�������L����,�ꎞ�a����̗L��,URL,���l,,
212067,0013000001,�򕌌�,���Ð�s,��F�ۈ牀,�C�b�V�L�z�C�N�G��,�F�����ۈ珊,���Ð�s���{��3-29,,,,,,0573-66-1330,,,,���Ð�s,1948-10-30,100,,,,,,,,,,
212067,0013000002,�򕌌�,���Ð�s,���Ð�ۈ牀,�i�J�c�K���z�C�N�G��,�F�����ۈ珊,���Ð�s�����T�ԂP�P��,,,,,,0573-66-1264,,,,���Ð�s,1950-07-01,120,,,,,,,,,,
212067,0013000003,�򕌌�,���Ð�s,�k��ۈ牀,�L�^�m�z�C�N�G��,�F�����ۈ珊,���Ð�s���쒬3-36,,,,,,0573-66-1501,,,,���Ð�s,1962-04-01,90,,,,,,,,,,
212067,0013000004,�򕌌�,���Ð�s,�c�ؕۈ牀,�i�G�M�z�C�N�G��,�F�����ۈ珊,���Ð�s�c��1610�3,,,,,,0573-66-1538,,,,���Ð�s,1963-04-01,110,,,,,,,,,,
212067,0013000005,�򕌌�,���Ð�s,�����ۈ牀,�I�`�A�C�z�C�N�G��,�F�����ۈ珊,���Ð�s����936-1,,,,,,0573-69-3527,,,,���Ð�s,1959-07-01,90,,,,,,,,,,
212067,0013000006,�򕌌�,���Ð�s,���ؕۈ牀,�A�M�z�C�N�G��,�F�����ۈ珊,���Ð�s����107-1,,,,,,0573-63-2341,,,,���Ð�s,1968-04-01,60,,,,,,,,,,
212067,0013000007,�򕌌�,���Ð�s,�≺�ۈ牀,�T�J�V�^�z�C�N�G���G��,�F�����ۈ珊,���Ð�s�≺1578-1,,,,,,0573-75-2167,,,,���Ð�s,1950-05-01,130,,,,,,,,,,
212067,0013000008,�򕌌�,���Ð�s,���ۈ牀,�J���J�~�z�C�N�G��,�F�����ۈ珊,���Ð�s���303-1,,,,,,0573-74-2350,,,,���Ð�s,1950-12-01,45,,,,,,,,,,
212067,0013000009,�򕌌�,���Ð�s,���q��ۈ牀,�J�V���z�C�N�G��,�F�����ۈ珊,���Ð�s���q��3417-7,,,,,,0573-79-2039,,,,���Ð�s,1954-08-20,110,,,,,,,,,,
212067,0013000010,�򕌌�,���Ð�s,�t�m�ۈ牀,�c�P�`�z�C�N�G��,�F�����ۈ珊,���Ð�s�t�m��5792,,,,,,0573-82-2379,,,,���Ð�s,1965-10-01,140,,,,,,,,,,
212067,0013000011,�򕌌�,���Ð�s,����ۈ牀,�V���m�z�C�N�G���G��,�F�����ۈ珊,���Ð�s����630-17,,,,,,0573-72-3312,,,,���Ð�s,1966-04-01,60,,,,,,,,,,
212067,0013000012,�򕌌�,���Ð�s,�����ۈ牀,�t�N�I�J�z�C�N�G���G��,�F�����ۈ珊,���Ð�s����699-1,,,,,,0573-72-2062,,,,���Ð�s,1965-01-01,120,,,,,,,,,,
212067,0013000013,�򕌌�,���Ð�s,���R�ۈ牀,�^�J���}�z�C�N�G���G��,�F�����ۈ珊,���Ð�s���R1063,,,,,,0573-72-5024,,,,���Ð�s,1964-07-01,60,,,,,,,,,,
212067,0013000014,�򕌌�,���Ð�s,�g��ۈ牀,�q���J���z�C�N�G���G��,�F�����ۈ珊,���Ð�s�g��4844-1,,,,,,0573-45-2611,,,,���Ð�s,1974-04-01,110,,,,,,,,,,
212067,0013000015,�򕌌�,���Ð�s,��������ۈ牀,�q�K�V�T�N���z�C�N�G��,�F�����ۈ珊,���Ð�s���Ð�1250-6,,,,,,0573-66-1213,,,,�Љ���@�l�����畟����,1978-04-01,90,,,,,,,,,,
212067,0013000016,�򕌌�,���Ð�s,��{������ۈ牀,�T�J���g�T�N���z�C�N�G��,�F�����ۈ珊,���Ð�s�֎q��1597-17,,,,,,0573-68-6611,,,,�Љ���@�l�����畟����,2014-04-01,110,,,,,,,,,,
212067,0013000017,�򕌌�,���Ð�s,�߂��ݕۈ牀,���O�~�z�C�N�G��,�F�����ۈ珊,���Ð�s�֎q��888-1,,,,,,0573-68-5157,,,,�Љ���@�l�b���,1979-04-01,105,,,,,,,,,,
212067,0013000018,�򕌌�,���Ð�s,�̂��ݕۈ牀,�m�]�~�z�C�N�G��,�F�����ۈ珊,���Ð�s�c��4596-7,,,,,,0573-67-2327,,,,�Љ���@�l�b���,1986-04-01,40,,,,,,,,,,
212067,0013000019,�򕌌�,���Ð�s,����̖ؕۈ牀,�J���m�L�z�C�N�G��,�F�����ۈ珊,���Ð�s����̖�2654-1,,,,,,0573-66-1533,,,,�Љ���@�l����̉蕟����,1980-04-01,40,,,,,,,,,,
212067,0013000020,�򕌌�,���Ð�s,���΂ƕۈ牀,�R�o�g�z�C�N�G��,�F�����ۈ珊,���Ð�s���Ð�2906-1,,,,,,0573-66-1537,,,,�Љ���@�l����̉蕟����,2016-04-01,79,,,,,,,,,,
212067,0013000021,�򕌌�,���Ð�s,��{���ǂ���,�T�J���g�R�h���G��,�F�肱�ǂ����i�c�ۘA�g�^�j,���Ð�s�֎q��841-1,,,,,,0573-68-4615,,,,���Ð�s,2020-04-01,135,,,,,,,,,,
212067,0013000022,�򕌌�,���Ð�s,�R�����ǂ���,���}�O�`�R�h���G��,�F�肱�ǂ����i�c�ۘA�g�^�j,���Ð�s�R��1647-36,,,,,,0573-75-2505,,,,���Ð�s,2022-04-01,30,,,,,,,,,,
212067,0013000023,�򕌌�,���Ð�s,�ɂ��@���܂̐X,�j�V�@�R�}�m����,�F�肱�ǂ����i�c�ۘA�g�^�j,���Ð�s���2416-1,,,,,,0573-66-3189,,,,�Љ���@�l�b���,2018-04-01,100,,,,,,,,,,
212067,0013000024,�򕌌�,���Ð�s,�삳����c�t��,�~�i�~�T�N�����E�`�G��,�F�肱�ǂ����i�c�ۘA�g�^�j,�򕌌����Ð�s���Ð�2358-1,,,,,,0573-65-3205,,,,�w�Z�@�l���Ð�w��,2019-04-01,190,,,,,,,,,,
212067,0013000025,�򕌌�,���Ð�s,���Ð�s�a���ۈ珊�u��������n�E�X�v,�i�J�c�K���V�r���E�W�z�C�N�W���u�N���b�R�n�E�X�v,�a���ۈ�{��,���Ð�s���1522-1,���Ð�s���a�@��,,,,,090-1278-3355,,,,,2019-04-01,3,,����,08:00,18:00,,,,�S���Ԗ���1000�~�^�S���Ԓ�2000�~,,
212067,0013000026,�򕌌�,���Ð�s,���Ð�s�q��Ďx���Z���^�[�ǁ[�Ȃ���              ,�i�J�c�K���V�R�\�_�e�V�G���Z���^�[�E�h�[�i�b�c              ,�n��q��Ďx�����_,���Ð�s�c��1533-1,���B�x���Z���^�[�ǂ񂮂��,,,,,0573-72-3589,,0573-72-3589,,,,,,�T�R���E����,09:15,15:30,11:45�`13:00�͕�,,,,,
212067,0013000027,�򕌌�,���Ð�s,��{�q��Ďx���Z���^�[,�T�J���g�R�\�_�e�V�G���Z���^�[,�n��q��Ďx�����_,���Ð�s��U��1457-13,��{�ӂꂠ���{��,,,,,0573-68-6840,,0573-68-6840,,,,,,�T�T���E����,09:30,16:45,6���`8����9:00�`17:15�A12:00�`13:00�͕�,,,,,
212067,0013000028,�򕌌�,���Ð�s,���Ð�s�q��Ďx���Z���^�[�ق��Ƃ��[��,�i�J�c�K���V�R�\�_�e�V�G���Z���^�[�E�z�b�g�P�[�L,�n��q��Ďx�����_,���Ð�s����5-11,���Ð�ۈ牀��,,,,,0573-66-1275,,0573-66-6939,,,,,,�T�T���E����,09:15,15:30,11:45�`13:00�͕�,,,,,
212067,0013000029,�򕌌�,���Ð�s,�ɂ��킢�v���U�q��Ďx���Z���^�[,�j�M���C�v���U�R�\�_�e�V�G���Z���^�[,�n��q��Ďx�����_,���Ð�s�h��1-1,�ɂ��킢�v���U�R�K,,,,,0573-66-1111,4288,,,,,,,����,09:30,16:45,12:00�`13:00�͕��A�ɂ��킢�v���U�ٓ��͕�,�L,,,,
212067,0013000030,�򕌌�,���Ð�s,���q��q��Ďx���Z���^�[�������,�J�V���R�\�_�e�V�G���Z���^�[�N�������p,�n��q��Ďx�����_,���Ð�s���q��3427-1,���q��ӂꂠ���R�~���j�e�B�Z���^�[,,,,,080-6912-5657,,,,,,,,�T�R���E����,09:15,15:00,11:45�`12:30�͕�,,,,,
212067,0013000031,�򕌌�,���Ð�s,�g��q��Ďx���Z���^�[�Ђ邩�����,�q���J���R�\�_�e�V�G���Z���^�[�q���J���b�R,�n��q��Ďx�����_,���Ð�s�g��2201-3,�g�슈�����Z���^�[,,,,,090-9752-2333,,,,,,,,�T�R���E����,09:15,14:45,12:00�`12:30�͕�,,,,,
212067,0013000032,�򕌌�,���Ð�s,�₳���q��Ďx���Z���^�[,���T�J�R�\�_�e�V�G���Z���^�[,�n��q��Ďx�����_,���Ð�≺1665-5,�≺������������2����,,,,,080-3638-1665,,,,,,,,�T�R���E����,09:15,15:00,12:00�`12:45�͕�,,,,,
212067,0013000033,�򕌌�,���Ð�s,���w�����ۈ珊,�q�K�V�K�N�h�E�_�C�C�`�z�C�N�W��,���ی㎙���N���u,���Ð�s���̏o��7-53,,,,,,0573-66-9033,,,,,,,,,,,�ʔN(�����x�Ɠ��܂�),,,�Ώۊw�Z�F���Ð�s�������w�Z,,
212067,0013000034,�򕌌�,���Ð�s,���w�����ۈ珊,�q�K�V�K�N�h�E�_�C�j�z�C�N�W��,���ی㎙���N���u,���Ð�s���{��5-1,�����w�Z��,,,,,0573-65-4123,,,,,,,,,,,�ʔN(�����x�Ɠ��܂�),,,�Ώۊw�Z�F���Ð�s�������w�Z,,
212067,0013000035,�򕌌�,���Ð�s,��w���ۈ珊,�~�i�~�K�N�h�E�z�C�N�W��,���ی㎙���N���u,���Ð�s���a��6-47,�쏬�w�Z��,,,,,0573-65-0155,,,,,,,,,,,�ʔN(�����x�Ɠ��܂�),,,�Ώۊw�Z�F���Ð�s���쏬�w�Z,,
212067,0013000036,�򕌌�,���Ð�s,���w���ۈ珊����,�j�V�K�N�h�E�z�C�N�W���\��,���ی㎙���N���u,���Ð�s���301-1,,,,,,0573-66-6673,,,,,,,,,,,�ʔN(�����x�Ɠ��܂�),,,�Ώۊw�Z�F���Ð�s�������w�Z,,
212067,0013000037,�򕌌�,���Ð�s,���w���ۈ珊�����悤,�j�V�K�N�h�E�z�C�N�W���^�C���E,���ی㎙���N���u,���Ð�s���301-1,,,,,,0573-65-8331,,,,,,,,,,,�ʔN(�����x�Ɠ��܂�),,,�Ώۊw�Z�F���Ð�s�������w�Z,,
212067,0013000038,�򕌌�,���Ð�s,���w���ۈ珊�ɂ�,�j�V�K�N�h�E�z�C�N�V���j�W,���ی㎙���N���u,���Ð�s���339-2,,,,,,070-1617-8478,,,,,,,,,,,�ʔN(�����x�Ɠ��܂�),,,�Ώۊw�Z�F���Ð�s�������w�Z,,
212067,0013000039,�򕌌�,���Ð�s,�c�؊w���ۈ珊�������傤�g,�i�G�M�K�N�h�E�z�C�N�W���X�C�V���E�N�~,���ی㎙���N���u,���Ð�s�c��1686,,,,,,0573-65-7368,,,,,,,,,,,�ʔN(�����x�Ɠ��܂�),,,�Ώۊw�Z�F���Ð�s���c�؏��w�Z,,
212067,0013000040,�򕌌�,���Ð�s,�c�؊w���ۈ珊������g,�i�G�M�K�N�h�E�z�C�N�W���T�N���N�~,���ی㎙���N���u,���Ð�s�c��1687,,,,,,0573-65-7368,,,,,,,,,,,�ʔN(�����x�Ɠ��܂�),,,�Ώۊw�Z�F���Ð�s���c�؏��w�Z,,
212067,0013000041,�򕌌�,���Ð�s,�c�؊w���ۈ珊���݂�g,�i�G�M�K�N�h�E�z�C�N�W���X�~���O�~,���ی㎙���N���u,���Ð�s�c��2083,�c�؏��w�Z��,,,,,080-4845-4508,,,,,,,,,,,�ʔN(�����x�Ɠ��܂�),,,�Ώۊw�Z�F���Ð�s���c�؏��w�Z,,
212067,0013000042,�򕌌�,���Ð�s,��{�w�����ی�N���u���ۈ珊,�T�J���g�K�N�h�E�z�E�J�S�N���u�_�C�C�`�z�C�N�W��,���ی㎙���N���u,���Ð�s��U��1460,,,,,,0573-68-6950,,,,,,,,,,,�ʔN(�����x�Ɠ��܂�),,,�Ώۊw�Z�F���Ð�s����{���w�Z,,
212067,0013000043,�򕌌�,���Ð�s,��{�w�����ی�N���u���ۈ珊,�T�J���g�K�N�h�E�z�E�J�S�N���u�_�C�j�z�C�N�W��,���ی㎙���N���u,���Ð�s��U��1460,,,,,,0573-68-6950,,,,,,,,,,,�ʔN(�����x�Ɠ��܂�),,,�Ώۊw�Z�F���Ð�s����{���w�Z,,
212067,0013000044,�򕌌�,���Ð�s,��{�w�����ی�N���u��O�ۈ珊,�T�J���g�K�N�h�E�z�E�J�S�N���u�_�C�T���z�C�N�W��,���ی㎙���N���u,���Ð�s��U��1460,,,,,,0573-68-6950,,,,,,,,,,,�ʔN(�����x�Ɠ��܂�),,,�Ώۊw�Z�F���Ð�s����{���w�Z,,
212067,0013000045,�򕌌�,���Ð�s,��w������Ԑ��g,�A�I�]���K�N�h�E�N���u�z�V�N�~,���ی㎙���N���u,���Ð�s��U��1457-6-12�@,�q�c���2�K,,,,,0573-68-7764,,,,,,,,,,,�ʔN(�����x�Ɠ��܂�),,,�Ώۊw�Z�F���Ð�s����{���w�Z,,
212067,0013000046,�򕌌�,���Ð�s,��w������ԓ��g,�A�I�]���K�N�h�E�N���u�j�W�N�~,���ی㎙���N���u,���Ð�s��U��1447-1,,,,,,0573-68-2063,,,,,,,,,,,�ʔN(�����x�Ɠ��܂�),,,�Ώۊw�Z�F���Ð�s����{���w�Z,,
212067,0013000047,�򕌌�,���Ð�s,�����w���ۈ珊,�I�`�A�C�K�N�h�E�z�C�N�W��,���ی㎙���N���u,���Ð�s����934-1,,,,,,0573-69-5567,,,,,,,,,,,�ʔN(�����x�Ɠ��܂�),,,�Ώۊw�Z�F���Ð�s���������w�Z,,
212067,0013000048,�򕌌�,���Ð�s,�≺�w���N���u,�T�J�V�^�K�N�h�E�N���u,���ی㎙���N���u,���Ð�s�≺2375,�≺���w�Z��,,,,,0573-75-3993,,,,,,,,,,,�ʔN(�����x�Ɠ��܂�),,,�Ώۊw�Z�F���Ð�s���≺���w�Z,,
212067,0013000049,�򕌌�,���Ð�s,��㎙���N���u�䂫��,�J���J�~�W�h�E�N���u���L���R,���ی㎙���N���u,���Ð�s���409-7,��㏬�w�Z��,,,,,080-1557-7152,,,,,,,,,,,�ʔN(�����x�Ɠ��܂�),,,�Ώۊw�Z�F���Ð�s����㏬�w�Z,,
212067,0013000050,�򕌌�,���Ð�s,�L�b�Y�T�[�N��,�L�b�Y�T�[�N��,���ی㎙���N���u,���Ð�s�t�m��10890,,,,,,0573-82-2099,,,,,,,,,,,�ʔN(�����x�Ɠ��܂�),,,�Ώۊw�Z�F���Ð�s���t�m�쏬�w�Z,,
212067,0013000051,�򕌌�,���Ð�s,�t�m�k�w���N���u,�c�P�`�L�^�K�N�h�E�N���u,���ی㎙���N���u,���Ð�s�t�m��3719-1,�t�m�k���w�Z��,,,,,080-2395-9290,,,,,,,,,,,�ʔN(�����x�Ɠ��܂�),,,�Ώۊw�Z�F���Ð�s���t�m�k���w�Z,,
212067,0013000052,�򕌌�,���Ð�s,�������ی㎙���N���u,�t�N�I�J�z�E�J�S�W�h�E�N���u,���ی㎙���N���u,���Ð�s����744-4,,,,,,0573-72-3748,,,,,,,,,,,�ʔN(�����x�Ɠ��܂�),,,�Ώۊw�Z�F���Ð�s���������w�Z,,
212067,0013000053,�򕌌�,���Ð�s,���q�ꎙ���N���u,�J�V���W�h�E�N���u,���ی㎙���N���u,���Ð�s���q��2781-72,,,,,,080-1581-8549,,,,,,,,,,,�ʔN(�����x�Ɠ��܂�),,,�Ώۊw�Z�F���Ð�s�����q�ꏬ�w�Z,,
212067,0013000054,�򕌌�,���Ð�s,���؋G�ߊw���܂Ȃт��q,�A�M�L�Z�c�K�N�h�E�}�i�r�b�R,���ی㎙���N���u,���Ð�s����79-1,���؏��w�Z��,,,,,090-8734-6595,,,,,,,,,,,�����x�Ɠ��̂�,,,�Ώۊw�Z�F���Ð�s�����؏��w�Z,,
212067,0013000055,�򕌌�,���Ð�s,�Ђ邩��w���N���u,�q���J���K�N�h�E�N���u,���ی㎙���N���u,���Ð�s�g��2178-1,,,,,,090-7912-4415,,,,,,,,,,,�ʔN(�����x�Ɠ��܂�),,,�Ώۊw�Z�F���Ð�s���g�쏬�w�Z,,
212067,0013000056,�򕌌�,���Ð�s,���Ð�s��������,�i�J�c�K���V�A�Y�}�W�h�E�J��,�����فE�����Z���^�[,���Ð�s���Ð�2364-1721,,,,,,0573-66-7448,,,,,,,,,09:30,17:00,6���`8����9:00�`17:30�A�x�ٓ�����,,,�x�ٓ��F���j���A��R�E�S�E�T���j���A�j���A�N���N�n,,
212067,0013000057,�򕌌�,���Ð�s,���Ð�s��������,�i�J�c�K���V�j�V�W�h�E�J��,�����فE�����Z���^�[,���Ð�s���1249-12,,,,,,0573-66-7443,,,,,,,,,09:30,17:00,6���`8����9:00�`17:30�A�x�ٓ�����,,,�x�ٓ��F���j���A��R�E�S�E�T���j���A�j���A�N���N�n,,
212067,0013000058,�򕌌�,���Ð�s,���Ð�s�����Z���^�[,�i�J�c�K���V�W�h�E�Z���^�[,�����فE�����Z���^�[,���Ð�s����̖ؒ�1-17,,,,,,0573-65-7871,,,,,,,,,09:30,17:00,6���`8����9:00�`17:30�A�x�ٓ�����,,,�x�ٓ��F���j���A��R�E�S�E�T���j���A�j���A�N���N�n,,
212067,0013000059,�򕌌�,���Ð�s,���Ð�s��{�ӂꂠ���{��,�i�J�c�K���V�T�J���g�t���A�C�V�Z�c,�����فE�����Z���^�[,���Ð�s��U��1457-13,,,,,,0573-68-6840,,,,,,,,,09:30,17:00,6���`8����9:00�`17:30�A�x�ٓ�����,,,�x�ٓ��F�y�E���j���A�j���A�N���N�n,,
212067,0013000060,�򕌌�,���Ð�s,���Ð�c�t��,�i�J�c�K�����E�`�G��,�����c�t��,���Ð�s���{��5-1,,,,,,0573-66-1553,,,,,,,,,,,,,,,,
212067,0013000061,�򕌌�,���Ð�s,��c�t��,�~�i�~���E�`�G��,�����c�t��,���Ð�s���a��6-47 ,,,,,,0573-66-1310,,,,,,,,,,,,,,,,
212067,0013000062,�򕌌�,���Ð�s,���c�t��,�j�V���E�`�G��,�����c�t��,���Ð�s���260-2 ,,,,,,0573-66-1356,,,,,,,,,,,,,,,,
212067,0013000063,�򕌌�,���Ð�s,�_��c�t��,�J�~�T�J���E�`�G��,�����c�t��,���Ð�s�_��1526-3 ,,,,,,0573-69-3774,,,,,,,,,,,,,,,,
212067,0013000064,�򕌌�,���Ð�s,���̎q�c�t��,�X�M�m�R���E�`�G��,�����c�t��,���Ð�s��ꎚ�㓴1195-7,,,,,,0573-66-1261,,0573-66-1263,,�w�Z�@�l�b��w��,1968-02-17,280,,,,,,,,,,
212067,0013000065,�򕌌�,���Ð�s,���a�c�t��,�Z�C�����E�`�G��,�����c�t��,���Ð�s����175,,,,,,0573-66-0237,,0573-67-9237,,�w�Z�@�l�΃��u�w��,1975-04-05,140,,,,,,,,,,
212067,0013000066,�򕌌�,���Ð�s,�t�m�̂��ݗc�t��,�c�P�`�m�]�~���E�`�G��,�����c�t��,���Ð�s�t�m��11010-3,,,,,,0573-82-2133,,0573-82-2475,,�w�Z�@�l���a�w��,1956-03-26,90,,,,,,,,,,
