�@�l�ԍ�,�\���Җ�(����),�\���Җ�(�J�i),��\��(��E),��\��(����),����(����),�����Q(����),����(�J�i),���ԍ�,���Ǝ햼,�Ǝ�זږ�1,�Ǝ�זږ�2,�Ǝ�זږ�3,�Ǝ�זږ�4,�Ǝ�זږ�5,�Ƒ�,������1,������2,������3,������4,�ŏ��̋��N����,���݂̋��N����,���݂̗L���N����,�c�Ə��X�֔ԍ�,�c�Ə��Z��,�c�Ə��d�b�ԍ�,,
3200001011667,���[�������ي������,���[�����Z�C�J,,�����@�Ȕ�,���[�������ي������,,���[�����Z�C�J,51001065,�َq������,�َq������,,,,,,,,,,R5.2.8,R5.2.8,R10.2.29,501-6003,�򕌌��H���S��쒬�����U�|�P�O�R,058-245-9608,,
9200002001604,�L����ЃP�C�E�G�C����,�P�C�G�C�V���E�W,��\�����,�؁@���g,�L����ЃP�C�E�G�C����,,�P�C�G�C�V���E�W,51001068,�����^��������������,������H�i,�Ⓚ�H�i,,,,,�g�p���͉��f�ŋۂ��邱�Ƌy�єN1��̌������󂯂邱��,,,,R5.2.8,R5.2.8,R10.2.29,501-6002,�򕌌��H���S��쒬�O��W�|�P�S�|�P,058-201-1235,,
,����@����,�~�Y�m�@�P���W,,,������,,�X�Y��,51001073,���H�X�c��,�߂�ސH��,,,,,,,,,,R5.2.1,R5.2.1,R10.2.29,501-6026,�򕌌��e�����s�쓇�������S�V�O�|�P�O,0586-89-4311,,
1200002007815,�L����Ѓ��X�g�����Ր�,���X�g�����L���Z��,��\������В�,�X�@�Ύ�,�L����Ѓ��X�g�����Ր�,,���X�g�����L���Z��,51001074,���H�X�c��,��ʐH��,�ӂ�����,�ٓ���,,,,�g�p���͉��f�ŋۂ��邱�Ƌy�єN1��̌������󂯂邱��,,,,R5.2.8,R5.2.8,R10.2.29,501-6022,�򕌌��e�����s�쓇���q���Q�S�U�W,0586-89-4121,,
,�s�@�W��,�J�N�@�`�����~����,,,�ǉƁ@�򕌓X,,�p���K�@�M�t�e��,51001076,���H�X�c��,��ʐH��,�ē���,,,,,,,,,R5.2.1,R5.2.1,R10.2.29,501-6011,�򕌌��H���S��쒬�����k�P�|�Q�O�O,058-249-0855,,
9200001011348,������Ђɂ��₩,�j�R���J,,�c���@���T,�]�˂x�`,,�G�h��,51001077,���H�X�c��,������,,,,,,,,,,R5.2.1,R5.2.1,R10.2.29,501-6001,�򕌌��H���S��쒬���H�S�|�P�S�W,058-246-1015,,
,�����@�O��,�}�c�o���@�e�c�W,,,�m�n�m�`�b�`�@�c�d�k�h�b�`,,�m�i�J�@�f���J,51001078,���H�X�c��,��ʐH��,����������,�ٓ���,,,,,,,,R5.2.8,R5.2.8,R10.2.29,501-6004,�򕌌��H���S��쒬�쒆�R���ڂU�V,090-6080-6117,,
,�����@�b���q,�t�W�n���@�G�~�R,,,�Җ�,,�^�C��,51001082,���H�X�c��,�y�H�i��,,,,,,,,,,R5.2.16,R5.2.16,R10.2.29,501-6011,�򕌌��H���S��쒬�����k�V�|�P�P�U,058-248-6037,,
9200001027922,������Ђ��肽,�����^,,�X�c�@����,�R���e�i�J�t�F�J�v���X,,�R���e�i�J�t�F�J�v���X,51001083,���H�X�c��,�y�H�i��,,,,,,�g�p���͉��f�ŋۂ��邱�Ƌy�єN1��̌������󂯂邱��,,,,R5.2.15,R5.2.15,R10.2.29,501-6016,�򕌌��H���S��쒬���c�R�|�P�Q�V,058-214-7884,,
,���c�@���v,�I�I�^�@�~�`�I,,,�\���{���k,,�\���{���k,51001084,���H�X�c��,�y�H�i��,,,,,,,,,,R5.2.22,R5.2.22,R10.2.29,501-6001,�򕌌��H���S��쒬���H�W�|�P�O�S�@���W�f���X���c�P�O�P,058-247-1197,,
3180301014190,������Ѓ^�p�X,�^�p�X,��\�����,�{�c�@�j�O,�^�p�X�@���X,,�^�p�X�@�M�i���e��,51001085,���H�X�c��,�Ă����΁E���D��,,,,,,,,,,R5.2.22,R5.2.22,R10.2.29,501-6012,�򕌌��H���S��쒬�����W���ڂU�T,058-247-0670,,
4200002011137,�L����Ђӂ���ݓX,�t�Z�����`�e��,��\�����,�����@���T,�L����Ђӂ���ݓX,,�t�Z�����`�e��,51001086,��������������,��������������,,,,,,�g�p���͉��f�ŋۂ��邱�Ƌy�єN1��̌������󂯂邱��,,,,R5.2.20,R5.2.20,R10.2.29,501-6006,�򕌌��H���S��쒬�����W�|�T,058-245-3036,,
,�����@����,�A�_�`�@�^�}�~,,,���y�X�^�W�I�E�B�b�V��,,�I���K�N�X�^�W�I�E�B�b�V��,51001093,���H�X�c��,�y�H�i��,,,,,,,,,,R5.2.27,R5.2.27,R10.2.29,501-6014,�򕌌��H���S��쒬��t���T�|�Q,058-273-7575,,
8200001011729,������Ѓz�[�v,�z�[�v,,�����@�K��,�J���[�n�E�X�b���b����ԉ��@���X,,�J���[�n�E�X�R�R�C�`�o�����M�i���e��,51001095,���H�X�c��,��ʐH��,,,,,,�g�p���͉��f�ŋۂ��邱�Ƌy�єN1��̌������󂯂邱��,,,,R5.2.22,R5.2.22,R10.2.29,501-6002,�򕌌��H���S��쒬�O��T�|�S�W,058-246-4986,,
,�Ћˁ@�L��,�J�^�M���@�q���L,,,�ˉ��炠����,,���������A�C�`,51001096,���H�X�c��,�߂�ސH��,,,,,,,,,,R5.2.15,R5.2.15,R10.2.29,501-6001,�򕌌��H���S��쒬���H�W�|�U�O�|�P,058-248-2055,,
1200003000620,������ЂȂ܂��␼�x�X,�i�}�Y���j�V�V�e��,,���c�@�d�j,�Ȃ܂�����X,,�i�}�Y���M�i���e��,51001098,���H�X�c��,��ʐH��,,,,,��ʐH��,,,,,R5.2.28,R5.2.28,R10.2.29,501-6011,�򕌌��H���S��쒬�����k�S�|�S�S,058-246-7233,,
,�㓡�@�G��,�S�g�E�@�q���L,,,�~�j�X�g�b�v��쒬���c�X,,�~�j�X�g�b�v�M�i���`���E�g�N�_�e��,51001101,���H�X�c��,�R���r�j�G���X�X�g�A,,,,,,,,,,R5.2.15,R5.2.15,R10.2.29,501-6016,�򕌌��H���S��쒬���c�R���ڂR�O�R,058-274-5533,,
9230001012830,������Ѓt�F�C�X,�t�F�C�X,��\�����,�O�c�@�ےj,�i���j�t�F�C�X�@�O�c��,,�t�F�C�X�@�}�G�_��,51001103,����ޔ̔���,����ޔ̔���,,,,,,,,,,R5.2.22,R5.2.22,R10.2.29,501-6002,�򕌌��H���S��쒬�O��S���ڂP�P�U,058-249-0787,,
7180002007028,�L����Ђe�E�j�t�[�h�T�[�r�X,�G�t�P�C�t�[�h�T�[�r�X,,�����@�K��,���ʗ{��V�l�z�[���@�J�[�T�E���X�؁[�g,,�g�N�x�c���E�S���E�W���z�[���@�J�[�T���X�y�[�g,51001113,���H�X�c��,���H�i�Љ���{�݁j,,,,,,,,,,R5.2.2,R5.2.2,R10.11.30,504-0815,�򕌌��e�����s�h�����h���P�|�T�O,058-385-3900,,
1080101006499,�}�b�N�X�o�������C�������,�}�b�N�X�o�����g�E�J�C,,�쓹�@����,�}�b�N�X�o�������X,,�}�b�N�X�o�����M�i���e��,51001114,���H�X�c��,������,,,,,,,,,,R5.2.16,R5.2.16,R10.2.29,501-6018,�򕌌��H���S��쒬����H�Q���ڂP�Q�|�P,058-276-3136,,
1080101006499,�}�b�N�X�o�������C�������,�}�b�N�X�o�����g�E�J�C,,�쓹�@����,�}�b�N�X�o�������X,,�}�b�N�X�o�����M�i���e��,51001115,���H�X�c��,����������,,,,,,,,,,R5.2.16,R5.2.16,R10.2.29,501-6018,�򕌌��H���S��쒬����H�Q���ڂP�Q�|�P,058-276-3136,,
1080101006499,�}�b�N�X�o�������C�������,�}�b�N�X�o�����g�E�J�C,,�쓹�@����,�}�b�N�X�o�������X,,�}�b�N�X�o�����M�i���e��,51001116,�H���̔���,�H���̔���,,,,,,,,,,R5.2.16,R5.2.16,R10.2.29,501-6018,�򕌌��H���S��쒬����H�Q���ڂP�Q�|�P,058-276-3136,,
1080101006499,�}�b�N�X�o�������C�������,�}�b�N�X�o�����g�E�J�C,,�쓹�@����,�}�b�N�X�o�������X,,�}�b�N�X�o�����M�i���e��,51001117,����ޔ̔���,����ޔ̔���,,,,,,,,,,R5.2.16,R5.2.16,R10.2.29,501-6018,�򕌌��H���S��쒬����H�Q���ڂP�Q�|�P,058-276-3136,,
1200001034348,������ЃT�����[���h,�T�����[���h,��\�����,�i�c�@���v,�n�[�g�u���b�h�A���e�B�[�N�@�I�A�V�X�p�[�N�X,�a�k�t�d�@�r�d�`�k,�n�[�g�u���b�h�A���e�B�[�N�@�I�A�V�X�p�[�N�e��,51001120,���H�X�c��,�y�H�i��,,,,,,�ȈՂȉc�ƂɌ���B,,,,R5.2.7,R5.2.7,R10.2.29,501-6021,�򕌌��e�����s�쓇�}�c���P�T�U�S�|�P�@�I�A�V�X�p�[�N��,0586-59-7003,,
4200001010791,������ЃG�C�`�G�X�G���^�[�v���C�Y,�G�C�`�G�X�G���^�[�v���C�Y,��\�����,�����@�T��,���[�\����쒬�����X,,���[�\���M�i���`���E�t�Z���e��,51001131,���H�X�c��,�R���r�j�G���X�X�g�A,,,,,,,,,,R5.2.22,R5.2.22,R10.2.29,501-6006,�򕌌��H���S��쒬�����S�|�P�R�U,058-248-8312,,
9200001011389,������Ѓo�C�p�X���H�Z���^�[,�o�C�p�X�L���E�V���N�Z���^�[,��\�����,����؁@��_,������Ѓo�C�p�X���H�Z���^�[�@���H��,,�o�C�p�X�L���E�V���N�Z���^�[�_�C�j�R�E�W���E,51001132,���H�X�c��,�d�o����,,,,,,�g�p���͉��f�ŋۂ��邱�Ƌy�єN1��̌������󂯂邱��,,,,R5.2.15,R5.2.15,R10.2.29,501-6003,�򕌌��H���S��쒬�����X�|�T�P,058-245-9381,,
9200001011389,������Ѓo�C�p�X���H�Z���^�[,�o�C�p�X�L���E�V���N�Z���^�[,��\�����,����؁@��_,������Ѓo�C�p�X���H�Z���^�[,,�o�C�p�X�L���E�V���N�Z���^�[,51001133,���H�X�c��,�d�o����,,,,,,�g�p���͉��f�ŋۂ��邱�Ƌy�єN1��̌������󂯂邱��,,,,R5.2.15,R5.2.15,R10.2.29,501-6003,�򕌌��H���S��쒬�����X�|�T�Q,058-245-9381,,
,�e���@���I,�J�J�~�@�A�L,,,���Ђ��܂̂�����,,�I�q�T�}�m�I�E�`,51001134,���H�X�c��,��ʐH��,,,,,,,,,,R5.2.15,R5.2.15,R10.11.30,504-0845,�򕌌��e�����s�h���\�q���P���ڂS�P�|�Q,070-2626-6675,,
2180001106883,������ЃW�F�C�v���W�F�N�g,�W�F�C�v���W�F�N�g,��\�����,�с@�T��,���킵�܃t�@�[�}�[�Y�e�[�u��,,�J���V�}�t�@�[�}�[�Y�e�[�u��,51001147,���H�X�c��,��ʐH��,,,,,,,,,,R5.2.20,R5.2.20,R10.2.29,501-6021,�򕌌��e�����s�쓇�}�c���P�T�U�S�|�P,0586-59-8855,,
4200002011137,�L����Ђӂ���ݓX,�t�Z�����`�e��,��\�����,�����@���T,�L����Ђӂ���ݓX,,�t�Z�����`�e��,51001150,�َq������,�������,,,,,,�g�p���͉��f�ŋۂ��邱�Ƌy�єN1��̌������󂯂邱��,,,,R5.2.27,R5.2.27,R10.2.29,501-6006,�򕌌��H���S��쒬�����W�|�T,058-245-3036,,
1200003003094,������Ѓm�[�X�g�[��,�m�[�X�g�[��,��\�Ј�,�k���@�N�s,���[�\���򕌉H���w�k�X,,���[�\���M�t�n�V�}�G�L�L�^�e��,51001155,���H�X�c��,�R���r�j�G���X�X�g�A,,,,,,,,,,R5.2.27,R5.2.27,R10.11.30,501-6255,�򕌌��H���s�������󕽂P���ڂX,058-372-8884,,
,�����@�I��,�i�J�����@���E��,,,�X�f���@�f�`�s�d,,�i�C���Y�Q�[�g,51001158,���H�X�c��,�o�[,,,,,,,,,,R5.2.27,R5.2.27,R10.11.30,501-6257,�򕌌��H���s�����������S�|�R�T�@�l�f���r���U�@�P�e,,,
5200001006277,������ЃA�C�E�r�[�E�G�X,�A�C�r�[�G�X,��\�����,����@�T�q,�ē��@������X,,���L�j�N�@�C�`���i�M�V���E�e��,51001165,���H�X�c��,��ʐH��,,�ē���,,,,,,,,R5.2.28,R5.2.28,R10.2.29,501-6001,�򕌌��H���S��쒬���H�U�|�V�U,058-215-0739,,
2380002007326,������А؏��X,�A�I�L�V���E�e��,��\�����,�؁@���,�ʏ`�H�[�ʗ�,,�J�W���E�R�E�{�E�J����,52000396,���H�X�c��,�y�H�i��,,,,,,,,,,R5.2.14,R5.2.14,R10.2.29,501-0406,�򕌌��{���s�O���P�P�O�O�������򕌂Q�K,058-324-7150,,
1120001074930,������Ћ������{��,�E�I�N�j�\�E�z���V��,,�c���@�L�_,���V�b�v�i���j��S�H�ꋛ�����{��,,���V�c�v�_�C�����R�E�W���E�E�I�N�j�\�E�z���V��,52000408,���H�X�c��,���H�i���Ə��j,,,,,,,,,,R5.2.1,R5.2.1,R10.2.29,501-0401,�򕌌��{���s��ۂP�Q�U�O�|�Q,058-323-6235,,
5200005003361,�Љ���@�l�{���s�Љ�����c��,���g�X�V�V���J�C�t�N�V�L���E�M�J�C,�,���@��F,�{���s�Ⴊ���ҏA�J�x���Z���^�[���̎q,,���g�X�V�V���E�K�C�V���V���E���E�V�G���Z���^�[�X�M�m�R,52000409,�َq������,�َq������,,,,,,,,,,R5.2.7,R5.2.7,R10.2.29,501-0418,�򕌌��{���s���܎O�U�V�S�Ԓn�S,058-323-0346,,
,�{���@�q,�~���V�^�@�T�g�V,,,�t�@�~���[�}�[�g�{������X,,�t�@�~���[�}�[�g���g�X���C�e��,52000410,���H�X�c��,�R���r�j�G���X�X�g�A,,,,,�R���r�j�G���X�X�g�A,,,,,R5.2.7,R5.2.7,R10.2.29,501-0417,�򕌌��{���s���䎚�����P�R�S�X�Ԓn�U,058-320-0122,,
5200005001043,�����g���򕌋��H�Z���^�[,�M�t�L���E�V���N�Z���^,,�l�c���@�p�Z,�򕌃J�����N������АH�����@�����g���򕌋��H�Z���^�[,,�M�t�J�����N,52000411,���H�X�c��,���H�i���Ə��j,,,,,,,,,,R5.2.24,R5.2.24,R10.2.29,501-0414,�򕌌��{���s�����䒃���W�W�O,080-1563-2071,,
5200005001043,�����g���򕌋��H�Z���^�[,�M�t�L���E�V���N�Z���^,,�l�c���@�p�Z,�򕌃L���r�l�b�g������АH�����@�����g���򕌋��H�Z���^�[,,�M�t�L���r�l�c�g,52000412,���H�X�c��,���H�i���Ə��j,,,,,,,,,,R5.2.24,R5.2.24,R10.2.29,501-0414,�򕌌��{���s�����P�P�T�O,090-7674-9959,,
7160001008920,������ЃV�[�E�I�[�E�G��,�J�u�V�L�J�C�V���V�[�I�[�G��,,�V�c����,�P���^�b�L�[�E�t���C�h�E�`�L���@�������򕌓X,,�P���^�b�L�[�t���C�h�`�L���@�������M�t�e��,52000413,���H�X�c��,�y�H�i��,,,,,,,,,,R5.2.1,R5.2.1,R10.2.29,501-0406,�򕌌��{���s�O���P�P�O�O,058-320-2802,,
,�����@�a��,�J�g�E�@�J�Y�q��,,,���蕨��,,�R�[�q�[���m�K�^��,52000414,�َq������,�َq������,,,,,,,,,,R5.2.10,R5.2.10,R10.2.29,501-0406,�򕌌��{���s�O���S�|�P�V,058-323-7887,,
,��؁@���q,,,,�����˖[�@���~�[�@�򕌖��L�q���쏊,,�V���^�C�����{�E�_�C�j�`���E�{�E�M�t�����M���E�U�Z�C�T�N�W��,52000415,�Ⓚ�H�i������,�Ⓚ�H�i������,,,,,,,,,,R5.2.10,R5.2.10,R10.2.29,501-0406,�򕌌��{���s�O���T�O�X�|�Q�P,058-322-8205,,
3200001009785,�C�r�f�����Y�������,�C�r�f���u�b�T���J�u�V�L�K�C�V��,,�v�ہ@�C��,�C�r�f�����Y�������,,�C�r�f���u�b�T���J�u�V�L�K�C�V��,52000416,���Y���i������,���Y���i������,,,,,,���N�P��g�p���̌������󂯂邱�ƁB,�g�p���͉��f�ŋۂ��邱�ƁB,,,R5.2.1,R5.2.1,R10.2.29,501-0415,�򕌌��{���s�L���R�R�X�Ԓn,058-324-1151,,
9200001000945,������Њp�c�Ζ�,�J�N�_�Z�L��,,�p�c�@�G��,�Z�u���C���u���{���ܔ��c�X,,�Z�u���C���u�����g�X�S�^���_�e��,52000417,���H�X�c��,�R���r�j�G���X�X�g�A,,,,,,,,,,R5.2.7,R5.2.7,R10.2.29,501-0405,�򕌌��{���s�Ό��T�V�S�Ԓn�S,058-322-3456,,
3180001058182,������ЃA�g��,�J�u�V�L�K�C�V���A�g��,��\�����,�R�p�@��,�ɂ���̓����q ���ѓX,,�j�M���m�g�N�x�G�@�C�g�k�L�e��,52000418,���H�X�c��,������,,,,,,,,,,R5.2.24,R5.2.24,R10.2.29,501-0406,�򕌌��{���s�O���T�|�P�T,058-324-9650,,
,�����@�m��,�J�g�E�@�q���~,,,�Ă��[��[�ށ@����,,�e�B�[���[���@�T�c�L,52000419,���H�X�c��,�y�H�i��,,,,,,���N�P��g�p���̌������󂯂邱�ƁB,�g�p���͉��f�ŋۂ��邱�ƁB,,,R5.2.6,R5.2.6,R10.2.29,501-0321,�򕌌�����s�����R�V�U�|�P,058-328-4646,,
,�n���@���q,�}�u�`�A�T�R,,,�A�T,,�A�T,52000420,���H�X�c��,�y�H�i��,,,,,,,,,,R5.2.7,R5.2.7,R10.2.29,501-0322,�򕌌�����s�Ë��P�V�S�S�|�P,058-328-4195,,
,�L�c�@�M�N,�g���_�@�^�J���X,,,�L�c��,,�g���_��,52000421,���H�X�c��,�����X,,,,,�����X,���N�P��g�p���̌������󂯂邱�ƁB,�g�p���͉��f�ŋۂ��邱�ƁB,,,R5.2.6,R5.2.6,R10.2.29,501-0312,�򕌌�����s���]���X�T�V,058-328-2013,,
,�с@�a�q,�n���V�@�J�Y�R,,,�ъ`��,,�n���V�J�L�G��,52000423,������H�i������,������H�i������,,,,,,,,,,R5.2.6,R5.2.6,R10.2.29,501-0314,�򕌌�����s�\�����V�S�Q,058-328-2302,,
6010001152957,������Џ΂���,�����^�R,��\�����,�c���@�͐�,�΂����@�������򕌓X,,�����^�R�������M�t�e��,52000424,���H�X�c��,�����₫,,,,,�����₫,,,,,R5.2.1,R5.2.1,R10.2.29,501-0406,�򕌌��{���s�O���P�P�O�O�@��������,058-324-6970,,
,�i��@�[�i,�i�K�T�N�@�t�T�V,,,���ؗ�������,,�`���E�J�����E���R�d�`,52000425,���H�X�c��,���ؗ���,,,,,,,,,,R5.2.10,R5.2.10,R10.2.29,501-0304,�򕌌�����s�c�V��U�Q�U,080-4544-9151,,
9200001013344,������Џ���~�[�g,�I�K���~�[�g,,����@���D,������Џ���~�[�g�Z���^�[,,�J�u�V�L�J�C�V���I�K���~�[�g�Z���^�[,52000426,�H��������,�H��������,,,,,,,,,,R5.2.6,R5.2.6,R10.2.29,501-0304,�򕌌�����s�c�V�㎚�����P�V�S�|�R,058-328-4341,,
2200001015792,������Б�M��,�^�C�V���P��,��\�����,�����@�C,��M���@����X,,�^�C�V���P���@�X�i�~�e��,52000427,���H�X�c��,���̑�,,,,,,,,,,R5.2.6,R5.2.6,R10.2.29,501-0304,�򕌌�����s�c�V��P�U�T�i�R�m�~������X���j,058-328-5300,,
,�H���@���j,�N�h�E�}�T�V,,,�߂񏈁@�H��,,�����h�R���N�h�E,52000429,���H�X�c��,�߂�ސH��,,,,,,,,,,R5.2.7,R5.2.7,R10.2.29,501-0417,�򕌌��{���s����P�Q�R�U�[�P�O,058-324-5986,,
,�n粁@����,���^�i�x�����E�W,,,����������,,�V���G��,52000434,���H�X�c��,�y�H�i��,,,,,�y�H�i��,,,,,R5.2.17,R5.2.17,R10.11.30,501-0222,�򕌌�����s�ʕ{�W�P�R�|�P�e�@�}���L�r��,090-5103-4471,,
1200001038588,������ЃO���[���u���U�[�Y,�O���[���u���U�[�Y,��\�����,�ΐ�@���,����z������,,�X�i�~�z������,52000435,���H�X�c��,�ē���,,,,,,,,,,R5.2.10,R5.2.10,R10.2.29,501-0303,�򕌌�����s�X�U�T�U�|�Q,058-328-6022,,
1200001038588,������ЃO���[���u���U�[�Y,�O���[���u���U�[�Y,��\�����,�ΐ�@���,�������a�`�r�d,,�M���E�V�I�x�[�X,52000436,���H�X�c��,�߂�ސH��,,,,,,,,,,R5.2.10,R5.2.10,R10.2.29,501-0304,�򕌌�����s�c�V��Q�S�P�|�P�@�k�S,058-328-7020,,
,�ēc�@�T��,�V�o�^�@�m���J,,,�������@�{�@�������@���������������@����������,,�A�[�g�v���X�C�[�g�A�g���G�t�F���X,52000438,���H�X�c��,�y�H�i��,,,,,,,,,,R5.2.14,R5.2.14,R10.2.29,501-0407,�򕌌��{���s�������S�Q�R�|�Q,050-8884-9136,,
,���{�@�N,�t�W���g���X�V,,,�p�X�e���A�@�W�W,,�p�X�e���A�W�W,52000442,���H�X�c��,���X�g����,,,,,,,,,,R5.2.17,R5.2.17,R10.5.31,501-0439,�򕌌��{���S�k�������J��P�X�P�O�|�P,,,
,�����@�N��,�i�J�����e�c��,,,�L�g�������X,,�g���V���Z�C�j�N�e��,52000443,���H�X�c��,����������,,,,,,,,,,R5.2.22,R5.2.22,R10.2.29,501-2259,�򕌌��R���s�⍲�V�U�T�|�R,0581-52-1137,,
,�����@�N��,�i�J�����e�c��,,,�L�g�������X,,�g���V���Z�C�j�N�e��,52000444,�H�����i������,�H�����i������,,,,,,,,,,R5.2.22,R5.2.22,R10.2.29,501-2259,�򕌌��R���s�⍲�V�U�T�|�Q,0581-52-1137,,
7200001009947,������ЎO�K,�T���R�E,,���@�m�q,������ЎO�K,,�T���R�E,52000446,�H��������,�H��������,,,,,,,,,,R5.2.22,R5.2.22,R10.8.31,501-0463,�򕌌��{���s���`�T�T�Q�|�V,058-324-2906,,
7030001001979,�J�b�p�E�N���G�C�g�������,�J�b�p�N���G�C�g�J�u�V�L�K�C�V��,,�R�p�@��,�����ώ��i��ϓX,,�J�b�p�Y�V�z�d�~�e��,52000447,�َq������,�َq������,,,,,,,,,,R5.2.24,R5.2.24,R10.11.30,501-0223,�򕌌�����s��ςP�U�U�U�|�P,058-329-5020,,
7030001001979,�J�b�p�E�N���G�C�g�������,�J�b�p�N���G�C�g,��\�����,�R�p�@��,�����ώ��i�@�������򕌓X,,�J�b�p�Y�V�������M�t�e��,52000448,�َq������,�َq������,,,,,,,,,,R5.2.24,R5.2.24,R10.2.29,501-0406,�򕌌��{���s�O���P�P�O�O�@�������򕌓X�@�P�P�X�V���,058-260-6262,,
,�y���@�r�F,�c�`���g�V�q�R,,,���[���ǂ�,,�\�[�X�h��,52000449,���H�X�c��,��ʐH��,,,,,,,,,,R5.2.28,R5.2.28,R10.11.30,501-0223,�򕌌�����s��ςP�S�T�Q�|�P,,,
7200002006563,������Г����؍H��,�t�W�I�J���b�R�E�V��,��\�����,�����@��,�����@����������,,�A���e�B�G�[��,52000450,�َq������,�َq������,,,,,,,,,,R5.2.28,R5.2.28,R10.5.31,501-2114,�򕌌��R���s����T�W�V�|�P,090-5853-6068,,
9200002013392,�L����Љ͍�,�J���C,,�͍��@�K��,�~�j�X�g�b�v��_�O�ԓX,,�~�j�X�g�b�v�I�I�K�L�g�o�i�e��,53001093,���H�X�c��,�R���r�j�G���X�X�g�A,,,,,,,,,,R5.2.1,R5.2.1,R10.2.29,503-0954,�򕌌���_�s�O�ԂR���ڂR�T�|�R,0584-88-2808,,
,����@�Ëv,�n�M�m�@���V�q�T,,,���쏤�X,,�n�M�m�V���E�e��,53001098,�َq������,�َq������,,,,,,���N�P��g�p���̌������󂯂邱�ƁB,�g�p���͉��f�ŋۂ��邱�ƁB,,,R5.2.7,R5.2.7,R10.2.29,503-0852,�򕌌���_�s�ѐX���S���ڂQ�O�P�X�|�P�P,0584-78-5096,,
,�썇�@�j�T,�J���C�@�q���t�~,,,���b�`�E�I�A�V�X,,���c�`�D�I�A�V�X,53001099,���H�X�c��,���X�g����,,,,,,���N�P��g�p���̌������󂯂邱�ƁB,�g�p���͉��f�ŋۂ��邱�ƁB,,,R5.2.7,R5.2.7,R10.2.29,503-0852,�򕌌���_�s�ѐX���U���ڂV�Q,0584-75-5990,,
,���J�@����,�~�Y�^�j�@�T�g�~,,,�C�܂���,,�L�}�O��,53001101,���H�X�c��,�X�i�b�N,,,,,,�ȈՂȉc�ƂɌ���B,,,,R5.2.7,R5.2.7,R10.2.29,503-0878,�򕌌���_�s�|�����R�U,0584-75-0209,,
3010702005994,�L����В�����,�i�J������,��\�����,�����@���v,���؂��΁@������,,�`���E�J�\�o�i�J������,53001102,���H�X�c��,�߂�ސH��,,,,,,,,,,R5.2.22,R5.2.22,R10.2.29,503-0865,�򕌌���_�s�������Q���ڂT�W,0584-73-3558,,
,�����@���j,�A�x�@�~�c�I,,,�i����,,�L�b�T�~�h��,53001103,���H�X�c��,�y�H�i��,,,,,,,,,,R5.2.1,R5.2.1,R10.2.29,503-0835,�򕌌���_�s���O�P���ڂP�X�|�R,0584-81-7462,,
8200001013155,������А�쉮,�A�T�m��,,�����@�O��,������А�쉮,,�A�T�m��,53001105,����������,����������,,,,,,���N�P��g�p���̌������󂯂邱�ƁB,�g�p���͉��f�ŋۂ��邱�ƁB,,,R5.2.27,R5.2.27,R10.2.29,503-0854,�򕌌���_�s�z�̒��T���ڂS�T,0584-89-6789,,
9180001046520,�T�K�~���X�g�����c�������,�T�K�~���X�g�����c,,�h�Á@�N�t,�T�K�~��_����X,,�T�K�~�I�I�K�L�^���C�e��,53001114,���H�X�c��,�߂�ސH��,,,,,,,,,,R5.2.1,R5.2.1,R10.2.29,503-0997,�򕌌���_�s���������l���W�S�X�|�Q,0584-92-1963,,
6200002012496,�L����Ђ��ӏ����i�������X,�M�t�n�c�Y�V�V�}�U�g�u���e��,,�����@�v,���ӏ����i�@�������X,,�M�t�n�c�Y�V�V�}�U�g�u���e��,53001116,���H�X�c��,������,,,,,,���N�P��g�p���̌������󂯂邱�ƁB,�g�p���͉��f�ŋۂ��邱�ƁB,,,R5.2.7,R5.2.7,R10.2.29,503-0935,�򕌌���_�s�����P���ڂR�R�|�P,0584-89-7753,,
,����@��l,�I�K���@�J�Y�q�g,,,�n�싏�����@�Ή�,,�\�E�T�N�C�U�J���@�V���E��,53001117,���H�X�c��,������,,,,,,,,,,R5.2.24,R5.2.24,R10.2.29,503-0836,�򕌌���_�s���P���ڂP�W,0584-74-8567,,
8200001013997,������Ѓf���J�X�C�g,�f���J�X�C�g,��\�����,�x�@�x��,������Ѓf���J�X�C�g�@,�V�قQ�K,�f���J�X�C�g�@,53001120,�َq������,�َq������,,,,,,���N�P��g�p���̌������󂯂邱�ƁB,�g�p���͉��f�ŋۂ��邱�ƁB,,,R5.2.7,R5.2.7,R10.2.29,503-0854,�򕌌���_�s�z�̒��T���ڂW�S,0584-89-4112,,
6200001016878,������Ћ��ɏ���,�E�I�V�Q�V���E�J�C,,���c�@����,������Ћ��ɏ���,,�E�I�V�Q�V���E�J�C,53001121,����ޔ̔���,����ޔ̔���,,,,,,,,,,R5.2.1,R5.2.1,R10.2.29,503-0854,�򕌌���_�s�z�̒��T���ڂW�U�|�R,0584-87-0808,,
6200001016878,������Ћ��ɏ���,�E�I�V�Q�V���E�J�C,,���c�@����,������Ћ��ɏ���,,�E�I�V�Q�V���E�J�C,53001122,��������������,��������������,,,,,,,,,,R5.2.1,R5.2.1,R10.2.29,503-0854,�򕌌���_�s�z�̒��T���ڂW�U�|�R,0584-87-0808,,
8200001011729,������Ѓz�[�v,�z�[�v,��\�����,�����@�K��,�J���[�n�E�X�b���b����ԉ��@��_�уm�X�X,,�J���[�n�E�X�R�R�C�`�o�����I�I�K�L�m�M�m�����e��,53001125,���H�X�c��,��ʐH��,,,,,,,,,,R5.2.7,R5.2.7,R10.2.29,503-0852,�򕌌���_�s�ѐX���S���ڂT�S,0584-73-0651,,
,�c���@�N�i,�^�i�J�@���X�W,,,�J�t�F�@�����ǂ����,,�J�t�F�@�O�b�h���b�N,53001126,���H�X�c��,�y�H�i��,,,,,,,,,,R5.2.1,R5.2.1,R10.2.29,503-0813,�򕌌���_�s�O�{�؂Q���ڂT,090-6094-3766,,
5180001035221,�X�K�L�R�V�X�e���Y�������,�X�K�L�R�V�X�e���Y,,���؁@�L��,�X�K�L����_�C�I�����[���X,,�X�K�L���I�I�K�L�C�I�����[���e��,53001127,���H�X�c��,�߂�ސH��,,,,,,,,,,R5.2.1,R5.2.1,R10.2.29,503-0933,�򕌌���_�s�O��Q���ڂP�O�O,080-6993-9494,,
,����@�z�q,���J�C�@���E�R,,,�C���h�l�p�[�������}�T���}�X�^�[,,�C���h�l�p�[�������E���}�T���}�X�^�[,53001130,���H�X�c��,�y�H�i��,,,,,,,,,,R5.2.1,R5.2.1,R10.2.29,503-0923,�򕌌���_�s�D���S���ڂP�R,0584-81-6999,,
,�n���@�x�m�v,���^�i�x�@�t�W�I,,,���B�x�m,,�J�b�|�E�t�W,53001134,���H�X�c��,��ʐH��,�d�o����,�ӂ�����,,,,���N�P��g�p���̌������󂯂邱�ƁB,�g�p���͉��f�ŋۂ��邱�ƁB,,,R5.2.24,R5.2.24,R10.2.29,503-0934,�򕌌���_�s�O���Q���ڂP�Q�O,0584-89-3358,,
,�ɓ��@�F�F,�C�g�E�@�^�J�q�R,,,���[�Ё[�͂����@�ς�Ղ���,,�p���v�L��,53001135,���H�X�c��,��ʐH��,,,,,,,,,,R5.2.1,R5.2.1,R10.2.29,503-0917,�򕌌���_�s�_�c���P���ڂU�P�@�@���₫�q���Y,0584-74-3054,,
,���@�W�i,�I�I�m�@�R�E�W,,,�i�������V���g�D,,�����V���g�D,53001136,���H�X�c��,�y�H�i��,,,,,,���N�P��g�p���̌������󂯂邱�ƁB,�g�p���͉��f�ŋۂ��邱�ƁB,,,R5.2.7,R5.2.7,R10.2.29,503-0864,�򕌌���_�s��j���S���ڂP�O�W�|�R,0584-78-4982,,
,���{�@��,�I�J���g�@�c�g��,,,��΂��ā@���㉮,,�W�_�C��,53001140,���H�X�c��,������,,,,,,,,,,R5.2.1,R5.2.1,R10.2.29,503-0974,�򕌌���_�s�v���쒬�S���ڂQ�T,0584-81-9429,,
,���c�@���K,���X�_�@�}�T���L,,,�ʎq���{�X,,�^�}�S���@�z���e��,53001145,���H�X�c��,�����X,�d�o����,,,,,���N�P��g�p���̌������󂯂邱�ƁB,�g�p���͉��f�ŋۂ��邱�ƁB,,,R5.2.22,R5.2.22,R10.2.29,503-0876,�򕌌���_�s�U���P�S�P,0584-78-4551,,
4180001079839,������Г���,�j�b�Z�C,,�����@�N��,�T�[�e�B�����A�C�X�N���[���@�C�I����_�X,,�T�[�e�B�����A�C�X�N���[���@�C�I���I�I�K�L�e��,53001146,���H�X�c��,�y�H�i��,,,,,���H�X,,,,,R5.2.1,R5.2.1,R10.2.29,503-0933,�򕌌���_�s�O��Q���ڂT�P�|�P,0584-88-3101,,
,�x�c�@��,�z�b�^�@�T�g��,,,���@�v���[�W��,,���@�v���[�W��,53001147,�A�C�X�N���[���ސ�����,�A�C�X�N���[���ސ�����,,,,,,,,,,R5.2.1,R5.2.1,R10.2.29,503-0836,�򕌌���_�s���R���ڂW�X�|�U,0584-74-6515,,
,�Óc�@�b��,�t���^�@�P�C�C�`,,,�J�t�F�Җ�,,�J�t�F�^�C��,53001148,���H�X�c��,�y�H�i��,�ٓ���,,,,,���N�P��g�p���̌������󂯂邱�ƁB,�g�p���͉��f�ŋۂ��邱�ƁB,,,R5.2.1,R5.2.1,R10.2.29,503-0815,�򕌌���_�s���]���Q�S�O�|�P,0584-75-2281,,
2310001003811,�����K�[�n�b�g�W���p���������,�����K�[�n�b�g�W���p��,,�����@�}���E,�����K�[�n�b�g�C�I�����[����_�X,,�����K�[�n�b�g�C�I�����[���I�I�K�L�e��,53001152,���H�X�c��,�߂�ސH��,,,,,,,,,,R5.2.7,R5.2.7,R10.2.29,503-0933,�򕌌���_�s�O��Q���ڂP�O�O,0584-87-0633,,
1120101049246,������Ђx�����@�r����,���[�T��,��\�����,���c�@�֖�,���s�k����@���[�����@�͉��@�C�I�����[����_�X,,���[�����J�C���L���C�I�����[���I�I�K�L�e��,53001153,���H�X�c��,�߂�ސH��,,,,,,,,,,R5.2.7,R5.2.7,R10.2.29,503-0933,�򕌌���_�s�O��Q���ڂP�O�O�@�Q�e�@�t�[�h�R�[�g��,0584-84-3305,,
7010401055214,�G�[���T�[�r�X�W���p���������,�G�[���T�[�r�X�W���p��,��\������В�,���J�@��,�G�[���r�i�P�S�R�Q�X,,�G�[���r�i�P�S�R�Q�e��,53001154,���H�X�c��,���H�i���Ə��j,,,,,,,,,,R5.2.7,R5.2.7,R10.2.29,503-0853,�򕌌���_�s�c�����P,0584-82-5035,,
7010401055214,�G�[���T�[�r�X�W���p���������,�G�[���T�[�r�X�W���p��,��\������В�,���J�@��,�G�[���r�i�P�S�R�Q�X,,�G�[���r�i�P�S�R�Q�e��,53001155,���H�X�c��,�y�H�i��,,,,,,,,,,R5.2.7,R5.2.7,R10.2.29,503-0853,�򕌌���_�s�c�����P,0584-82-5035,,
9200003002948,������Ђ邴�Ƃb�r,�c���U�g�V�[�G�X,,�ߓ��@�T��,���[�\����_�������X,,���[�\���I�I�K�L�V�}�U�g�`���E�e��,53001156,���H�X�c��,�R���r�j�G���X�X�g�A,,,,,,,,,,R5.2.7,R5.2.7,R10.2.29,503-0935,�򕌌���_�s�����P���ڂV�X�|�P,0584-89-9072,,
2200002014083,�L����Ђǂ��,�h���T�N,,�X���@��,�ǂ��,���[���[,�h���T�N,53001159,�A�C�X�N���[���ސ�����,�A�C�X�N���[���ސ�����,,,,,,,,,,R5.2.1,R5.2.1,R10.2.29,503-0837,�򕌌���_�s���䒬�U���ڂP�T�|�T,0584-74-9493,,
,�����@�K�c,���R�n�^�@���L�m��,,,�H�����@�K�@����X,,�N�C�h�R���@�T�`�@�A���m�e��,53001160,���H�X�c��,������,,,,,,,,,,R5.2.1,R5.2.1,R10.2.29,503-0984,�򕌌���_�s����U���ڂP�Q�Q,0584-92-4369,,
7011001031943,�X�^�[�o�b�N�X�R�[�q�[�W���p���������,�X�^�[�o�b�N�X�R�[�q�[�W���p��,,�����@�M��,�X�^�[�o�b�N�X�R�[�q�[�C�I�����[����_,,�X�^�[�o�b�N�X�R�[�q�[�C�I�����[���I�I�K�L,53001161,���H�X�c��,�y�H�i��,,,,,,,,,,R5.2.7,R5.2.7,R10.2.29,503-0933,�򕌌���_�s�O��Q���ڂP�O�O,0584-87-3426,,
6370001010914,������Ѓ��[���h�g���x��,���[���h�g���x��,��\�����,�����@�q��,��_���a�z�e��,,�I�I�K�L�r�����z�e��,53001163,���H�X�c��,���X�g����,,,,,,,,,,R5.2.7,R5.2.7,R10.2.29,503-0878,�򕌌���_�s�|�����V�S�A�V�U,0584-84-2668,,
820000101592,�D�����܂��Â��芔�����,�t�i�}�`�~�i�g�}�`�d�N��,��\�����,�O�ց@���j,�m�Ԉ�,,�o�V���E�A��,53001164,���H�X�c��,�y�H�i��,,,,,,,,,,R5.2.20,R5.2.20,R10.2.29,503-0923,�򕌌���_�s�D���Q���ڂQ�U�|�P,0584-78-3334,,
,�����@�G�u,�q�r�m�@�q�f�V,,,�Z�u���C���u����_��j���P���ړX,,�Z�u���C���u���I�I�K�L�~�i�~�m�J�I�`���E�C�b�`���E���e��,53001165,���H�X�c��,�R���r�j�G���X�X�g�A,,,,,,,,,,R5.2.7,R5.2.7,R10.2.29,503-0864,�򕌌���_�s��j���P���ڂW�S,0584-75-1851,,
5200001002276,������ЃT���|�[�M�t,�T���|�[�M�t,,�����@�T��,�~�X�^�[�h�[�i�c�@��_�X,,�~�X�^�[�h�[�i�c�@�I�I�K�L�e��,53001166,���H�X�c��,�y�H�i��,,,,,,,,,,R5.2.9,R5.2.9,R10.2.29,503-0851,�򕌌���_�s�ѐX���S���ڂU�O,0584-74-6132,,
5200001002276,������ЃT���|�[�M�t,�T���|�[�M�t,,�����@�T��,�~�X�^�[�h�[�i�c�@��_�X,,�~�X�^�[�h�[�i�c�@�I�I�K�L�e��,53001167,�َq������,�َq������,,,,,,,,,,R5.2.9,R5.2.9,R5.10.1,503-0851,�򕌌���_�s�ѐX���S���ڂU�O,0584-74-6132,,
6200001020814,�����t�[�Y�������,�`���E�u�t�[�Y,,�㒁@���F,�����t�[�Y������Б�_��X,,�`���E�u�t�[�Y�I�I�K�L�~�i�~�e��,53001170,���H�X�c��,����������,������,,,,,,,,,R5.2.22,R5.2.22,R10.2.29,503-0932,�򕌌���_�s�{�������m���P�U�R�X�|�P,,,
,���c�@�i�K,�^�J�_�@���V���L,,,�ē���������,,���L�j�N���b�`����,53001175,���H�X�c��,�ē���,�ٓ���,,,,,,,,,R5.2.7,R5.2.7,R10.2.29,503-0854,�򕌌���_�s�z�̒��R���ڂP�S,0584-51-4888,,
5200001002276,������ЃT���|�[�M�t,�J�u�V�L�K�C�V���T���|�[�M�t,,�����@�T��,�~�X�^�[�h�[�i�c�@�C�I����_�X,,�~�X�^�[�h�[�i�c�@�C�I���I�I�K�L�e��,53001177,���H�X�c��,�y�H�i��,,,,,,,,,,R5.2.27,R5.2.27,R10.2.29,503-0933,�򕌌���_�s�O��Q���ڂP�O�O,0584-87-3489,,