�s���{���R�[�h���͎s�撬���R�[�h,NO,�s���{����,�s�撬����,����,����_�J�i,����_�ʏ�,����_�p��,����������,���,�ꏊ����,�Z��,����,�ܓx,�o�x,�d�b�ԍ�,�����ԍ�,�����i���j,�����i�P�ʁj,�@�l�ԍ�,���L�ғ�,�������w���,���p�\�j��,�J�n����,�I������,���p�\�������L����,�摜,�摜_���C�Z���X,�T�v,�T�v_�p��,����,����_�p��,URL,���l
213616,0104000001,�򕌌�,���䒬,���O,�V���E���E,,,�d�v������,������,,,,,,,,1,��,,,1965-02-09,,,,,,,,,,,,
213616,0104000002,�򕌌�,���䒬,�ؑ���t�@������,���N�]�E���N�V�j�����C�����E�]�E,,,�d�v������,����,,,,,,,,1,��,,,1965-02-09,,,,,,,,,,,,
213616,0104000003,�򕌌�,���䒬,�S��,�e�b�g�E,,,�d�v������,�H�|�i,,,,,,,,1,��,,,1956-03-28,,,,,,,,,,,,
213616,0104000004,�򕌌�,���䒬,����,�g�E�P��,,,�d�v������,�H�|�i,,,,,,,,7,��,,,1974-11-13,,,,,,,,,,,,
213616,0104000005,�򕌌�,���䒬,�g�������Г���,�x�j�C�g�i�J�V���I�h�V�h�E�}��,,,�d�v������,�H�|�i,,,,,,,,1,��,,,1977-03-11,,,,,,,,,,,,
213616,0104000006,�򕌌�,���䒬,����Չg?,�^���C�}�c���q�L���},,,����������,�d�v�L�`����������,,,,,,,,3,�q,,,1961-06-19,,,,,,,,,,,,
213616,0104000007,�򕌌�,���䒬,�\�����ۗx,�I�T�^�C�R�I�h��,,,����������,�d�v���`����������,,,,,,,,,,,,1976-06-04,,,,,,,,,,,,
213616,0104000008,�򕌌�,���䒬,�|�����w����,�^�P�i�J�W�����A�g,,,�L�O��,�j��,,,,,,,,1,���,,,1956-03-28,,,,,,,,,,,,
213616,0104000009,�򕌌�,���䒬,�{������,�O�E�V���W�A�g,,,�L�O��,�j��,,,,,,,,1,���,,,1956-03-28,,,,,,,,,,,,
213616,0104000010,�򕌌�,���䒬,�{��p����,�~���V���n�C�W�A�g,,,�L�O��,�j��,,,,,,,,1,���,,,1968-08-06,,,,,,,,,,,,
213616,0104000011,�򕌌�,���䒬,�t���E�����̕�,�n���I�E�E���X�I�E�m�n�J,,,�L�O��,�j��,,,,,,,,3,��,,,1968-08-06,,,,,,,,,,,,
213616,0104000012,�򕌌�,���䒬,����̐�,�^���C�m�C�Y�~,,,�L�O��,�j��,,,,,,,,1,���,,,1968-08-06,,,,,,,,,,,,
213616,0104000013,�򕌌�,���䒬,��{�_�Ќo�ˌQ�@���o�y�i�ꊇ,�i���O�E�W���W���L���E�d�J�O���c�P�^���V���c�h�q���C�b�J�c,,,�L�O��,�j��,,,,,,,,,,,,1968-11-11,,,,,,,,,,,,
213616,0104000014,�򕌌�,���䒬,�����A�I�K�G���Q���n,�����A�I�K�G���O���Z�C�`,,,�L�O��,�V�R�L�O��,,,,,,,,1,���,,,1957-07-09,,,,,,,,,,,,
213616,0104000015,�򕌌�,���䒬,�I���A���̃T�J�L,�N���n���������m�T�J�L,,,�L�O��,�V�R�L�O��,,,,,,,,1,�{,,,1975-12-10,,,,,,,,,,,,
213616,0104000016,�򕌌�,���䒬,�ɕx��_�Ђ̑�X�M,�C�u�L�W���W���m�I�I�X�M,,,�L�O��,�V�R�L�O��,,,,,,,,1,�{,,,1975-12-10,,,,,,,,,,,,
