�@�l�ԍ�,�\���Җ�(����),�\���Җ�(�J�i),��\��(��E),��\��(����),����(����),�����Q(����),����(�J�i),,���ԍ�,���Ǝ햼,�Ǝ�זږ�1,�Ǝ�זږ�2,�Ǝ�זږ�3,�Ǝ�זږ�4,�Ǝ�זږ�5,�Ƒ�,������1,������2,������3,������4,���݂̋��N����,�J�n�N����,���݂̗L���N����,�c�Ə��X�֔ԍ�,�c�Ə��Z��,�c�Ə��d�b�ԍ�,,
4180001101313,�C�I���r�b�O�������,����ޯ��,��\������В�,���с@�����Y,�U�E�r�b�O���X,,���ޯ�޷�����,,51001266,�َq������,�َq������,,,,,,���̑�,,,�Ⓚ���n�̎g�p�Ɍ���B,R5.6.2,R 5. 6. 2,R11.2.28,501-6016,�򕌌��H���S��쒬���c�R���ڂP�X�P�|�P,058-213-3507,,
5200001032827,������Ђm���������h��,Ŷ޵Ŀ�,,�����@�a�F,�y���L��,,��ݷ�,,51001269,���H�X�c��,�y�H�i��,,,,,,,,,,R5.6.8,R 5. 6. 8,R10.11.30,501-6232,�򕌌��H���s�|�@���ό��T�S�O,058-216-8682,,
5200001032827,������Ђm���������h��,Ŷ޵Ŀ�,,�����@�a�F,�y���L��,,��ݷ�,,51001270,�َq������,�َq������,,,,,,,,,,R5.6.8,R 5. 6. 8,R10.11.30,501-6232,�򕌌��H���s�|�@���ό��T�S�O,058-216-8682,,
2040001000456,�C�I�����e�[���������,����ðٶ�޼��޲��,,��o�@����,�C�I�����e�[���i���j�C�I���e�����X,�p���H��,����ðٲ�ݶ�ж�����,,51001272,���H�X�c��,�y�H�i��,,,,,,,,,,R5.6.9,R 5. 6. 9,R10.8.31,504-0943,�򕌌��e�����s�߉����꒬�R�|�W,058-375-3500,,
9100001024178,������ЃA�r���e�B,����è,��\������В�,���c�@�s�u,�}�N�h�i���h�@��쒬�X,,ϸ�����޷��������,,51001277,���H�X�c��,�y�H�i��,,,,,,,,,,R5.6.27,R 5. 6.27,R11.2.28,501-6012,�򕌌��H���S��쒬�����P�|�P,058-246-5380,,
,�I�J�{�@�q��,����� ļ��,,,�������@�I��,,���޺� ����,,51001287,���H�X�c��,������,,,,,,�g�p���͉��f�ŋۂ��邱�Ƌy�єN1��̌������󂯂邱��,,,,R5.6.30,R 5. 6.30,R10.11.30,504-0854,�򕌌��e�����s�h��������Q���ڂP�T�|�R,058-389-3778,,
,�e�n�@�����,������,,,�t�@�~���[�}�[�g�{����ۓX,,̧�ذϰ��Ľ������,,52000564,���H�X�c��,�R���r�j�G���X�X�g�A,,,,,,,,,,R5.6.19,R 5. 6.19,R11.2.28,501-0401,�򕌌��{���s��ۂP�Q�T�U�Ԓn�U�X,058-320-2501,,
6010401063457,������ЃV�j�A���C�t�N���G�C�g,�Ʊײ̸ش��,��\�����,�����@�m,�q���Z�ޘa�̗�,,ؽ�����,,52000565,���H�X�c��,���H�i�Љ���{�݁j,,,,,,,,,,R5.6.20,R 5. 6.20,R10.11.30,501-0225,�򕌌�����s�c���]�Q�W�V�|�P,058-322-3111,,
3200001009785,�C�r�f�����Y�������,�������ޯ�ݶ�޼��޲��,,�v�ہ@�C��,�C�r�f�����Y�������,,�������ޯ�ݶ�޼��޲��,,52000566,�Ⓚ�H�i������,�Ⓚ�H�i������,,,,,,���N�P��g�p���̌������󂯂邱�ƁB,�g�p���͉��f�ŋۂ��邱�ƁB,,,R5.6.21,R 5. 6.21,R11.2.28,501-0415,�򕌌��{���s�L���R�R�X�Ԓn,058-324-1151,,
3200001009785,�C�r�f�����Y�������,�������ޯ�ݶ�޼��޲��,,�v�ہ@�C��,�C�r�f�����Y�������,,�������ޯ�ݶ�޼��޲��,,52000567,������H�i������,������H�i������,,,,,,���N�P��g�p���̌������󂯂邱�ƁB,�g�p���͉��f�ŋۂ��邱�ƁB,,,R5.6.21,R 5. 6.21,R11.2.28,501-0415,�򕌌��{���s�L���R�R�X�Ԓn,058-324-1151,,
8200001031520,������Ѓo���[,��޼�������۰,,�X�@���K,�o���[��ϐ��X,,��۰ν��Ƽ��,,52000569,���H�X�c��,������,,,,,,,,,,R5.6.21,R 5. 6.21,R10.11.30,501-0235,�򕌌�����s�\����������O�Q�U�U�[�P,058-329-5050,,
8200001031520,������Ѓo���[,��޼�������۰,,�X�@���K,�o���[��ϐ��X,,��۰ν��Ƽ��,,52000570,�َq������,�َq������,,,,,,,,,,R5.6.21,R 5. 6.21,R10.11.30,501-0235,�򕌌�����s�\����������O�Q�U�U�[�P,058-329-5050,,
6200001020814,�����t�[�Y�������,�����̰��,��\�����,�㒁@���F,�����t�[�Y������Е�ϐ��X,,�����̰�޶�޼��޲������Ƽ��,,52000571,���H�X�c��,����������,������,,,,,,,,,R5.6.21,R 5. 6.21,R10.11.30,501-0235,�򕌌�����s�\��𒹋��O�Q�U�U�|�P,058-329-5050,,
2200001040808,������Ђf�`�k�k�d�q�h�`,���ر,,�͍��@�^��,�f�`�k�k�d�q�h�`,,���ر,,52000575,���H�X�c��,�y�H�i��,,,,,,,,,,R5.6.27,R 5. 6.27,R10.11.30,501-0204,�򕌌�����s�n��t�J���Q���ڂT�S�Ԓn,058-372-3339,,
,�����@���N,Ŷ�� ļ�,,,�l�h�k�`�m�c�@�e�`�q�l,,����� ̧��,,53001449,���H�X�c��,�y�H�i��,,,,,,���N�P��g�p���̌������󂯂邱�ƁB,�g�p���͉��f�ŋۂ��邱�ƁB,,,R5.6.6,R 5. 6. 6,R10.8.31,503-0203,�򕌌������S�֔V���������V�c������Q�T�W,090-7684-7388,,
,�����@���N,Ŷ�� ļ�,,,�l�h�k�`�m�c�@�e�`�q�l,,����� ̧��,,53001450,�َq������,�َq������,,,,,,���N�P��g�p���̌������󂯂邱�ƁB,�g�p���͉��f�ŋۂ��邱�ƁB,,,R5.6.6,R 5. 6. 6,R10.8.31,503-0203,�򕌌������S�֔V���������V�c������Q�T�W,090-7684-7388,,
,�����@���N,Ŷ�� ļ�,,,�l�h�k�`�m�c�@�e�`�q�l,,����� ̧��,,53001451,������H�i������,������H�i������,,,,,,���N�P��g�p���̌������󂯂邱�ƁB,�g�p���͉��f�ŋۂ��邱�ƁB,,,R5.6.6,R 5. 6. 6,R10.8.31,503-0203,�򕌌������S�֔V���������V�c������Q�T�W,090-7684-7388,,
9200001039240,������БN�����˂�,�ݷޮ���,,�����@�_�a,�������Ȏ�,����ӂ�,�����,,53001453,����ޔ̔���,�ӂ�����,���H�p�N����ގ戵,,,,,,,,,R5.6.9,R 5. 6. 9,R11.5.31,503-0321,�򕌌��C�Îs���c�������P�T�X�U�|�P,0584-65-0378,,
9200001039240,������БN�����˂�,�ݷޮ���,,�����@�_�a,�������Ȏ�,����ӂ�,�����,,53001455,���H�X�c��,����������,,,,,,,,,,R5.6.9,R 5. 6. 9,R11.5.31,503-0321,�򕌌��C�Îs���c�������P�T�X�U�|�P,0584-65-0378,,
9200003005959,������ЉƘa,��,,�j ����,��p�����@���{,,����خ�� ح��,,53001456,���H�X�c��,���ؗ���,,,,,,,,,,R5.6.13,R 5. 6.13,R11.2.28,503-0984,�򕌌���_�s����U���ڂP�V�X�|�P,0584-40-1650,,
2200003001667,������Ў��,�Ȳ�,,���Á@����,������Ў��,,�Ȳ�,,53001459,�َq������,�َq������,,,,,,,,,,R5.6.19,R 5. 6.19,R11.2.28,503-0926,�򕌌���_�s�ؐΒ��Q���ڂR�O,0584-78-5384,,
6200001013941,������Гc��������ׂ����{��,�ŶԾ��޲���ݹ,��\�����,�c���@�T��,�c�̒���,,��Ŷ�,,53001463,���H�X�c��,�y�H�i��,,,,,,,,,,R5.6.20,R 5. 6.20,R11.5.31,503-1637,�򕌌���_�s��ΒÒ����V��P�O�Q�R,0584-78-3583,,
4010001061160,������Ѓ��p�X�g,��߽�,��\�����,���@����,�Z�F���w������Њ򕌃v�����g�@�\���H��,,���Ӷ�޸��޼��޲���������� ��Ų����޳,,53001465,���H�X�c��,���H�i���Ə��j,,,,,,,,,,R5.6.20,R 5. 6.20,R10.8.31,503-0125,�򕌌������S���������\�����R�V�T�O,090-4662-0765,,
4010001061160,������Ѓ��p�X�g,��߽�,��\�����,���@����,�Z�F���w������Њ򕌃v�����g�@�򕌗��H��,,���Ӷ�޸��޼��޲���������� ���خ�����޳,,53001466,���H�X�c��,���H�i���̑��j,,,,,,,,,,R5.6.20,R 5. 6.20,R10.8.31,503-0126,�򕌌������S���������{�P�O�Q�|�U,0584-64-2282,,
,��؁@���q�q,��޷ ���,,,�����Z�_�Ƌ����g���t�@�[�}�[�Y�e�b�N,,Ƽ��ɳ�ޮ�����޳�б�̧�ϰ��ï�,,53001468,�Е�������,�Е�������,,,,,,,,,,R5.6.28,R 5. 6.28,R10.11.30,503-0849,�򕌌���_�s���O���X�T�T�|�P,0584-81-2453,,
5200003003438,���ɂ�����񍇓����,��Ʋ���,,�ߓ��@����,���ɂ������̓X,,��Ʋ����о,,53001470,�َq������,�َq������,,,,,,,,,,R5.6.29,R 5. 6.29,R11.5.31,503-0312,�򕌌��C�Îs���c���O���P�X�W�S,0584-66-2822,,
,���z�@�܂��,н޺� ���,,,�Z�u���C���u���򕌑��ܔV���X,,���ݲ���ݷ�̵�ɺ�����,,55000319,���H�X�c��,�R���r�j�G���X�X�g�A,,,,,,,,,,R5.6.12,R 5. 6.12,R11.5.31,501-0554,�򕌌��K��S��쒬�ܔV�������X���R�X�V,0585322525,,
5120001061561,������Ђg�d�r�s�`��q,ͽ�����,��\�����,����@�Òj,��쉷��,���X,����ض�ܵݾ�,,56000609,���H�X�c��,�y�H�i��,,,,,,�g�p���͉��f�ŋۂ��邱�Ƌy�єN1��̌������󂯂邱��,�ȈՂȉc�ƂɌ���B,,,R5.6.7,R 5. 6. 7,R10.8.31,501-2901,�򕌌��֎s��S�P�V�T�|�X,0581-57-2822,,
5200003005384,������ЉԐ���,��н޷,��\�Ј�,���{�@����,������,,���,,56000610,���H�X�c��,�ٓ���,,,,,,,,,,R5.6.7,R 5. 6. 7,R11.2.28,501-3705,�򕌌����Z�s���ԂT�T�S�Ԓn,0575313001,,
7200003005655,������Ђ�������������,���ް,��\�Ј�,��c�@����,���������������@�k�`�m�c,,���ް����,,56000611,���H�X�c��,�ȈՏh��,,,,,,,,,,R5.6.9,R 5. 6. 9,R11.2.28,501-3788,�򕌌����Z�s�n���V�Q�U,0575-34-0310,,
,���c�@�\�F,Ŷ�� ּ˺,,,���������@�`��������,,�ީ ����,,56000612,�َq������,�َq������,,,,,,,,,,R5.6.9,R 5. 6. 9,R11.2.28,501-3736,�򕌌����Z�s�ĉ����Q�U�U�R�|�Q,090-3138-2678,,
6200005011388,�����c�������@�l�݂΂��̉�,ĸò˴�ض��޳γ��������ɲ�,������,�V��@���,���[�N�V���b�v�n�j�[,,ܰ�������ư,,56000613,���H�X�c��,�݂��炵,,,,,,,,,,R5.6.9,R 5. 6. 9,R10.8.31,501-3521,�򕌌��֎s���V�ێ���^���L�T�P�O�T,0575-49-2665,,
,�R���@���ގq,�ϳ� �ź,,,�R�c�_��L�b�`��,,����ɳ�ޮ�����,,56000614,�Е�������,�Е�������,,,,,,,,,,R5.6.14,R 5. 6.14,R11.5.31,501-3256,�򕌌��֎s��2����122-5,09050061116,,
,�R���@���ގq,�ϳ� �ź,,,�R�c�_��L�b�`��,,����ɳ�ޮ�����,,56000615,��������������,��������������,,,,,,,,,,R5.6.14,R 5. 6.14,R11.5.31,501-3256,�򕌌��֎s��2����122-5,09050061116,,
9999999999999,�򕌌������Z���ʎx���w�Z,��̹������ɳĸ��¼�ݶޯ��,�Z��,�哇�@�B�j,�򕌌������Z���ʎx���w�Z�@�i���a�����a����,,��̹������ɳĸ��¼�ݶޯ�� ���������,,56000616,�َq������,�َq������,,,,,,,,,,R5.6.14,R 5. 6.14,R10.11.30,501-3938,�򕌌��֎s�˃��u�P���ڂQ�Ԓn�@�򕌌����֓��ʎx���w�Z���@��꒲����,0575-24-1773,,
,�_�J�@���b,��� �Ŵ,,,�X�i�b�N�@�C��,,�ů����,,56000617,���H�X�c��,�X�i�b�N,,,,,,�ȈՂȉc�ƂɌ���B,,,,R5.6.19,R 5. 6.19,R11.5.31,501-3253,�򕌌��֎s�h���S���ڂT�|�T�S�@�P�O�Q��,0575-29-3636,,
,�����@���K,�нށ@���,,,�ÉƃJ�t�F,,�ٲ��̪,,57000583,���H�X�c��,�y�H�i��,,,,,�y�H�i��,,,,,R5.6.12,R 5. 6.12,R11.2.28,501-4204,�򕌌��S��s���������T�Q�S,090-4855-0384,,
,�g�c�@����,ּ�ށ@������,,,�p�`��.,,�����ټ,,57000587,����������������,����������������,,,,,,,,,,R5.6.12,R 5. 6.12,R10.8.31,501-4213,�򕌌��S��s�������a���Q�O�|�R,09032573932,,
,�a�c�@�M�v,��� ��޵,,,�a�c���X,,��޼����,,57000588,�H��������,�H��������,,,,,,,,,,R5.6.20,R 5. 6.20,R11.5.31,501-4302,�򕌌��S��s���󊦐��P�Q�P�W�|�P,0575-87-2033,,
,�a�c�@�M�v,��� ��޵,,,�a�c���X,,��޼����,,57000589,����ޔ̔���,����ޔ̔���,,,,,,,,,,R5.6.20,R 5. 6.20,R11.5.31,501-4302,�򕌌��S��s���󊦐��P�Q�P�W�|�P,0575-87-2033,,
,���c�@������,̼���@���,,,�������H�g���T�N���H�[,,��ж���б���׺��޳,,57000591,�݂����͂��傤�䐻����,�݂����͂��傤�䐻����,,,,,,,,,,R5.6.20,R 5. 6.20,R11.2.28,501-4102,�򕌌��S��s�����������R�X�V�|�P,090-8422-9849,,
,���c�@������,̼���@���,,,�������H�g���T�N���H�[,,��ж���б���׺��޳,,57000592,�Е�������,�Е�������,,,,,,,,,,R5.6.20,R 5. 6.20,R11.2.28,501-4102,�򕌌��S��s�����������R�X�V�|�P,090-8422-9849,,
5180001140748,������Ђs�D�a�q�`�h�m�r,��޼��޲��è���ڲݽ�,,����@�O��,�s.�a  �������������� �ԂȂ̐X,,è��ް����������,,57000593,�َq������,�َq������,,,,,,,,,,R5.6.20,R 5. 6.20,R11.5.31,501-4601,�򕌌��S��s��a����Ԍ��P�X�U,07015313007,,
5200001039698,������Ѓt�N�n�`,��޼��޲��̸��,,�h���@�B�L,�t�N�n�`�H���X,,̸�����Ƹ��,,57000594,�H��������,�H��������,,,,,,,,,,R5.6.23,R 5. 6.23,R10.11.30,501-5121,�򕌌��S��s�����������P�Q�S�|�Q,0575-82-2343,,
,�V�J�@�O�}�q,���� д�,,,���邷�݂̗��H�[,,�ٽ�ɻĺ��޳,,57000595,�Е�������,�Е�������,,,,,,,,,,R5.6.23,R 5. 6.23,R11.5.31,501-4303,�򕌌��S��s����C�ǂP�Q�P�S�|�S,0575-87-2434,,
3200001041094,������Ѓt�W�},��޼��޲��̼��,,���c�@����,�t�@�~���[�}�[�g�S�㏬��X,,̧�ذϰĸ޼ޮ�����,,57000596,���H�X�c��,�R���r�j�G���X�X�g�A,,,,,�R���r�j�G���X�X�g�A,,,,,R5.6.28,R 5. 6.28,R11.2.28,501-4221,�򕌌��S��s����������U�|�P�|�Q,0575660567,,
3200001041094,������Ѓt�W�},��޼��޲��̼��,,���c�@����,�t�@�~���[�}�[�g�S���X,,̧�ذϰĸ޼ޮ������,,57000597,���H�X�c��,�R���r�j�G���X�X�g�A,,,,,�R���r�j�G���X�X�g�A,,,,,R5.6.28,R 5. 6.28,R11.2.28,501-4223,�򕌌��S��s��������P�P�T�O,0575662448,,
7180001024676,������Ё@�A���y��,��޼����� �����,,����@�֔V,�s�����@�k�n�n�j,,�� ٯ�,,57000598,���H�X�c��,���X�g����,,,,,���X�g����,,,,,R5.6.28,R 5. 6.28,R10.11.30,501-5231,�򕌌��S��s�������ΓO���P�R�T�Ԓn�P,0575-86-3516,,
,�J���e���X�@�G�h���[�h�@�A���h�E,���۽ ���ܰ�� ���޳,,,�N���@�G�f�B,,�� ��ި,,58001246,����ޔ̔���,����ޔ̔���,,,,,,,,,,R5.6.5,R 5. 6. 5,R11.5.31,509-0206,�򕌌����s�y�c�T�O�S�V�|�R,0574-26-9989,,
4200001017250,������Ћ��{���x�r�[�Z���^�[,ʼ������ް����,��\�����,���J���@�G,�l�`���@���{��,,�ݷޮ��޺� ʼ���,,58001253,���H�X�c��,�y�H�i��,,,,,,,,,,R5.6.9,R 5. 6. 9,R10.8.31,505-0045,�򕌌����Z���Ύs���J���P���ڂR�ԂR��,0574-25-5907,,
1200001035619,������З�,���,,����@�T��,���̔n�͉�,,Ƹ���ط�,,58001254,�H��������,�H��������,,,,,,,,,,R5.6.8,R 5. 6. 8,R11.5.31,509-0206,�򕌌����s�y�c�V�S�P�|�P,0574-25-0029,,
1200001035619,������З�,���,,����@�T��,���̔n�͉�,,Ƹ���ط�,,58001255,��������������,��������������,,,,,,,,,,R5.6.8,R 5. 6. 8,R11.5.31,509-0206,�򕌌����s�y�c�V�S�P�|�P,0574-25-0029,,
1180302024876,�L����ЗF�a,ճ�,,�g��@�F��,���������@���l�ѓX,,����޸خ�� ֺ������,,58001258,���H�X�c��,���ؗ���,,,,,,,,,,R5.6.8,R 5. 6. 8,R11.2.28,505-0122,�򕌌����S�䐓����˂P�O�O�S�Ԓn�W,0574-67-3208,,
,��ˁ@�C�i,��¶ �����,,,�V�R��������,,�Żݶ̪,,58001259,���H�X�c��,�y�H�i��,,,,,,,,,,R5.6.8,R 5. 6. 8,R11.2.28,505-0121,�򕌌����S�䐓�����򃖒r�Q�T�T�|�Q,090-9918-9887,,
,��ˁ@�C�i,��¶ �����,,,�V�R��������,,�Żݶ̪,,58001260,�َq������,�َq������,,,,,,,,,,R5.6.8,R 5. 6. 8,R11.2.28,505-0121,�򕌌����S�䐓�����򃖒r�Q�T�T�|�Q,090-9918-9887,,
,�����@����,Ŷ�� ����,,,�L�q�@�Ȃ݂�,,�ޮ��� �з,,58001262,���H�X�c��,��ʐH��,,,,,,,,,,R5.6.13,R 5. 6.13,R10.8.31,505-0034,�򕌌����Z���Ύs�È䒬���È�Q�X�V�T�|�P�U,070-9125-2379,,
1200002022772,�L����Ђa�t�[�h�T�[�r�X,�ް̰�޻��޽,�����,��_�@����,�������}���X,,������ݽ,,58001263,�H���̔���,�H���̔���,,,,,,,,,,R5.6.13,R 5. 6.13,R11.5.31,509-0214,�򕌌����s�L���U�R�O�|�T,0574-63-0857,,
4200001041300,�j�[���������,�����,,��{�@���m,�y�ʎ��Ɓ@�Ȃ���,,���޲��� ŵ�,,58001266,���H�X�c��,������,,,,,,,,,,R5.6.13,R 5. 6.13,R11.5.31,509-0214,�򕌌����s�L���W�V�U�Ԓn�W,0574-62-8017,,
4200001041300,�j�[���������,�����,,��{�@���m,�y�ʎ��Ɓ@�Ȃ���,,���޲��� ŵ�,,58001267,�H���̔���,�H���̔���,,,,,,,,,,R5.6.13,R 5. 6.13,R11.5.31,509-0214,�򕌌����s�L���W�V�U�Ԓn�W,0574-62-8017,,
,�ɍ����@�P�v,���� �ٵ,,,�܁[�����V���C��,,ϰ�ެݼ���,,58001270,���H�X�c��,�y�H�i��,,,,,,�ȈՂȉc�ƂɌ���B,,,,R5.6.22,R 5. 6.22,R10.8.31,505-0032,�򕌌����Z���Ύs�c�����P���ڂP�|�P�U,0574-27-1943,,
,�{���@�Í�,��޳ ��޶,,,�t�@�~���[�}�[�g���Z���Ή��Ζ�X,,̧�ذϰ��ɶӶ����,,58001271,���H�X�c��,�R���r�j�G���X�X�g�A,,,,,,,,,,R5.6.22,R 5. 6.22,R10.8.31,505-0053,�򕌌����Z���Ύs���Ζ쒬�ؖ�S�U�W�Ԓn�Q�P,0574-23-2650,,
8200001031520,������Ѓo���[,��۰,,�X�@���K,�o���[���b�y�X,,��۰�Ӵ����,,58001278,����ޔ̔���,����ޔ̔���,,,,,,,,,,R5.6.29,R 5. 6.29,R11.5.31,509-0203,�򕌌����s���b�y�R�Q�O�W,0574-60-6200,,
8200001031520,������Ѓo���[,��۰,,�X�@���K,�o���[���b�y�X,,��۰�Ӵ����,,58001279,���H�X�c��,������,,,,,,,,,,R5.6.29,R 5. 6.29,R11.5.31,509-0203,�򕌌����s���b�y�R�Q�O�W,0574-60-6200,,
,�V�؁@����,��� �����,,,�s�������@�h�������������@�r�`�h,,ķ��رݻ�,,59001138,��������������,��������������,,,,,��������������,,,,,R5.6.1,R 5. 6. 1,R10.5.31,509-5112,�򕌌��y��s��c���}�_���R���ڂU�P,0572-55-4068,,
,���c�@�M�L,̼�� ����,,,�Ηq�s�b�c�@��������,,������߯§Ѱ�,,59001151,��������������,��������������,,,,,,,,,,R5.6.7,R 5. 6. 7,R10.11.30,507-0814,�򕌌��������s�s�V�q���U���ڂR�O�|�P,0572-21-3353,,
,���{�@�^�L��,Ƽ�� ���,,,�p���Ƃ��َq�@�ڂ��ڂ�,,���ĵ��������,,59001153,�َq������,�َq������,,,,,,,,,,R5.6.16,R 5. 6.16,R10.11.30,507-0813,�򕌌��������s��C���P�P���ڂU�W,090-8952-5835,,
8200001021083,������Ж���d�@,��޼��޲��Ҳ����ݷ,��\�����,����@����,�E�B���O�@�t���C�h�}��,,��ݸ� �ײ����,,59001155,���H�X�c��,�ٓ���,,,,,,,,,,R5.6.14,R 5. 6.14,R11.2.28,507-0065,�򕌌��������s���{���U���ڂW�U�|�Q,0572-27-2235,,
,���؁@����,�۷ ض,,,�a�������@�o������������,,��ٰ���Я��,,59001161,���H�X�c��,�L���o���[,,,,,�L���o���[,,,,,R5.6.16,R 5. 6.16,R11.5.31,509-5101,�򕌌��y��s�򒬉͍��X�O�W�|�P,0572-54-2929,,
,�ɓ��@�q��,�ĳ��,,,������ �b,,���޼�,,60001073,���H�X�c��,�y�H�i��,,,,,�y�H�i��,,,,,R5.6.1,R 5. 6. 1,R10.8.31,508-0351,�򕌌����Ð�s�t�m���W�T�W�P�|�P,,,
,�]��@����,�����,,,���ӂ���,,�̸�,,60001074,��������������,��������������,,,,,,,,,,R5.6.6,R 5. 6. 6,R10.11.30,508-0033,�򕌌����Ð�s���c���Q���ڂS�|�P�Q,0573-65-5014,,
,�]��@����,�����,,,���ӂ���,,�̸�,,60001075,������H�i������,������H�i������,,,,,,,,,,R5.6.6,R 5. 6. 6,R10.11.30,508-0033,�򕌌����Ð�s���c���Q���ڂS�|�P�Q,0573-65-5014,,
8200002024606,�L����ЂȂ��݂̗�,ճ��ݶ޲��ź��ɻ�,��\�����,�����@����,�Ȃ��݂̗�,,ź��ɻ�,,60001080,���H�X�c��,���H�i�Љ���{�݁j,,,,,���H�i�Љ���{�݁j,,,,,R5.6.14,R 5. 6.14,R10.11.30,508-0015,�򕌌����Ð�s����P�V�T�|�V,0573-66-5133,,
8200002024606,�L����ЂȂ��݂̗�,ճ��ݶ޲��ź��ɻ�,��\�����,�����@����,�Ȃ��݂̗�,,ź��ɻ�,,60001081,�َq������,�َq������,,,,,,,,,,R5.6.14,R 5. 6.14,R10.11.30,508-0015,�򕌌����Ð�s����P�V�T�|�V,0573-66-5133,,
,�`�f�t�r�s�h�m�@�d�k�d�m�h�s�`�@�r�`�m�s�n�r,��޽èݴ����Ľ,,,�q�`�b�d�@�p��������,,ڰ�����,,60001084,���H�X�c��,�X�i�b�N,,,,,�X�i�b�N,�ȈՂȉc�ƂɌ���B,,,,R5.6.14,R 5. 6.14,R10.11.30,508-0032,�򕌌����Ð�s�h���S�R�V�|�P�Q,090-2180-1968,,
,���@�ǗY,��ּ�,,,����,,���,,60001085,���H�X�c��,��ʐH��,,,,,��ʐH��,,,,,R5.6.23,R 5. 6.23,R10.11.30,508-0502,�򕌌����Ð�s�n�ĂS�Q�X�S�|�Q,0264-57-2453,,
6200002026190,�L����ЂЂ����싽�������,��޼׶ܺ޳�����,��\�����,��J�@���V,�Ђ����싽�������,,��޼׶ܺ޳�����,,62001276,���H�X�c��,�y�H�i��,,,,,,,,,,R5.6.5,R 5. 6. 5,R11.5.31,501-5627,�򕌌����S���쑺�����S�T�Q�Ԓn,05769-6-1388,,
,����@�x�q,�ɳ� �º,,,���悢��,,�ֲ�޷,,62001278,���H�X�c��,������,,,,,,,,,,R5.6.12,R 5. 6.12,R11.2.28,506-0008,�򕌌����R�s���c���P���ڂQ�U�@�r�h�m�r���Q�K,090-5451-5705,,
9200002025149,�L����Ѝ[�N�H�i,���������,��\�����,����@�됰,�y����[�N,,���Է���,,62001279,���H�X�c��,�d�o����,�ٓ���,,,,,,,,,R5.6.12,R 5. 6.12,R11.2.28,506-0058,�򕌌����R�s�R�c���P�S�T�P�|�P�O,0577-34-6393,,
9200002025149,�L����Ѝ[�N�H�i,���������,��\�����,����@�됰,�y����[�N,,���Է���,,62001280,��������������,��������������,,,,,,,,,,R5.6.12,R 5. 6.12,R11.2.28,506-0058,�򕌌����R�s�R�c���P�S�T�P�|�P�O,0577-34-6393,,
,�c��@�Y��,��� ճ��,,,��������,,����,,62001281,�َq������,�َq������,,,,,,,,,,R5.6.16,R 5. 6.16,R11.2.28,506-0017,�򕌌����R�s�������Q�S�@�ł��Ȃ鉡��,080-3623-3120,,
,ꎓ��@�a�F,��ĳ ���˺,,,�N��,,��׹�,,62001282,���H�X�c��,�߂�ސH��,,,,,,,,,,R5.6.16,R 5. 6.16,R10.11.30,506-0845,�򕌌����R�s���V���S�U,0577-32-8270,,
2200003004983,������Иa�v�n�q�j�r,ź�� ܰ��,,�x�]�@�a�l,���[�\�����R�����{�X,,۰�����ϼӵ�����,,62001283,���H�X�c��,�R���r�j�G���X�X�g�A,,,,,,,,,,R5.6.26,R 5. 6.26,R11.2.28,506-0052,�򕌌����R�s�����{���P�W�V�X,,,
2200001025445,������В��эH���X,Ŷ��Լ�����,��\�����,���с@�O�i,�����䂭��,,خ���ո�,,62001284,���H�X�c��,����,,,,,,,,,,R5.6.16,R 5. 6.16,R10.8.31,506-1433,�򕌌����R�s����ˉ��򋽕����U�Q�P�|�Q,0578-89-2620,,
9200001026908,������Д�ˊ��̔�,��޷�����޲,,�����@�M�F,�����܍H�[,,���Ϻ��޳,,62001285,�َq������,�َq������,,,,,,,,,,R5.6.13,R 5. 6.13,R10.8.31,509-4254,�򕌌���ˎs�Ð쒬�㒬�P�R�S�U�|�P�@�i��ˎY���s����ȓ��j,090-7692-2022,,
,���R�@�Ђ��,����� ���,,,�b�r�͂Ȃ݂���,,������н޷,,62001287,�َq������,�َq������,,,,,,,,,,R5.6.26,R 5. 6.26,R11.2.28,506-0001,�򕌌����R�s�~�����T�U�S,090-6460-6876,,
7200001025382,������ЃT���T��������,�ݻݱ��,��\�����,��@�a��,���Y�i������,���̉w�H�[,ĸ��������޲�ޮ,,62001288,������H�i������,������H�i������,,,,,,,,,,R5.6.26,R 5. 6.26,R11.5.31,509-3325,�򕌌����R�s���������΂P�T�O�Ԓn,0577-55-3777,,
7200001025382,������ЃT���T��������,�ݻݱ��,��\�����,��@�a��,���Y�i������,���̉w�H�[,ĸ��������޲�ޮ,,62001289,����ޔ̔���,����ޔ̔���,,,,,,,,,,R5.6.26,R 5. 6.26,R11.5.31,509-3325,�򕌌����R�s���������΂P�T�O�Ԓn,0577-55-3777,,
,�X�΁@���F,��� ��˺,,,���������H�i,,���ؼ����,,62001291,�Е�������,�Е�������,,,,,,,,,,R5.6.26,R 5. 6.26,R10.8.31,509-4121,�򕌌����R�s���{���F�Í]�U�X�V�|�P,0577-72-4761,,
,���c�@����,���� ���,,,�������������@�k�n�s�t�r�@�k�`�m�c,,����۰������,,62001294,���H�X�c��,�߂�ސH��,,,,,,,,,,R5.6.22,R 5. 6.22,R11.2.28,506-0851,�򕌌����R�s��V���Q���ڂW�Q�Ԓn,0577-70-1177,,
4200001037240,������Ѓ��C���b�N,ײׯ�,��\�����,�ɓ��@�h�q,�b�������������@����������,,���ذ۰�ީ,,62001297,���H�X�c��,���X�g����,,,,,,,,,,R5.6.30,R 5. 6.30,R10.11.30,506-0026,�򕌌����R�s�ԗ����U���ڂR�W�|�R�W�@�J���g���[�z�e���P�K,,,
